program: Gaussian 09
title: 000036723
version: EM64L-G09RevD.01
frameworkgroup: C1[X(C13H27Cl)]
method: RPBEPBE
basis: SDD
operation: Freq
keyword: #p
keyword: freq=noraman
keyword: PBEPBE/SDD
title: #p freq=noraman PBEPBE/SDD
converged: YES YES NO NO
title: Mulliken charges:
elementType: Cl C C C C C C C C C C C C C H H H H H H H H H H H H H H H H H H H H H H H H H H H
charge: -0.119229 -0.375546 -0.379577 -0.375708 -0.354069 -0.384947 -0.366328 -0.371803 -0.337953 -0.353387 -0.355672 -0.356591 -0.695594 -0.696403 0.218333 0.205007 0.232406 0.199674 0.194496 0.188290 0.264633 0.195852 0.190655 0.192345 0.238270 0.190216 0.188392 0.180010 0.216034 0.188890 0.187304 0.198055 0.190358 0.194271 0.195208 0.209263 0.214452 0.215703 0.210234 0.209394 0.215062
chargesum: 0.00000
title: Mulliken charges with hydrogens summed into heavy atoms:
elementType: Cl C C C C C C C C C C C C C
charge: -0.119229 0.047794 0.052503 0.007079 -0.089436 0.001560 0.064287 0.006804 0.058092 0.022808 0.032740 0.032887 -0.056178 -0.061713
polarizability: 1.85453724e+02 -1.78393275e+00 1.35486040e+02 1.57746289e+00 3.42941762e+00 1.33492019e+02
1716.lowfreq: -12.7326 -3.4499 -0.0031 -0.0030 -0.0019 5.1061 20.9545 26.3330 33.5289
frequency: 20.5931 26.2489 33.5179 50.9333 60.3758 69.5236 84.0812 89.0588 113.3254 130.7768 137.5674 144.2453 149.9043 172.5186 224.5098 229.9875 249.7348 272.5135 286.4813 317.3617 392.9250 404.8990 451.5232 462.6903 532.7276 614.3061 719.5468 726.7706 729.4809 743.7746 780.2611 792.1810 847.6264 885.2246 890.1602 910.6622 914.0333 935.7089 990.0312 999.3654 1012.7067 1031.4066 1040.4159 1050.9753 1073.3571 1077.7181 1079.3997 1081.6453 1093.2919 1113.0828 1128.3103 1161.7316 1187.2229 1194.6789 1206.9554 1224.6988 1231.6998 1242.4163 1261.0093 1264.0447 1279.9323 1280.5783 1285.5483 1290.4201 1292.2716 1294.2575 1297.6296 1310.8866 1332.1997 1348.3378 1353.0942 1354.8744 1360.7674 1370.4083 1388.8146 1391.6808 1444.3469 1447.0741 1461.3289 1461.6948 1466.3014 1467.3121 1471.4060 1475.7668 1476.0471 1478.5081 1478.5537 1485.0692 1487.2334 1488.9120 2947.5907 2948.7441 2949.7162 2951.9336 2954.6976 2959.2322 2960.9888 2967.0849 2968.4067 2971.2213 2973.8483 2975.4871 2982.6298 2989.4774 3001.2953 3005.6687 3016.3414 3022.8106 3026.2145 3035.5488 3042.6649 3049.6528 3055.6884 3067.5669 3069.9579 3070.5305 3072.8933
redmass: 4.1004 1.7274 2.7768 2.4857 2.6324 2.4703 2.6717 2.0684 3.1182 2.0463 2.4463 2.5418 2.2960 3.5130 1.1223 1.1783 2.9160 3.1521 2.6585 3.3352 3.0381 3.1445 3.0512 3.0683 3.7627 3.3010 1.0622 1.0820 1.0876 1.1287 1.2110 1.2212 1.2732 2.2355 1.9484 1.3735 1.8652 1.3460 1.8586 3.3114 1.5905 2.5653 2.4314 2.6978 2.1578 2.0838 2.0268 1.9092 1.5515 1.9879 2.6603 2.1387 1.6795 1.4371 1.4036 1.3897 1.3342 1.2926 1.2947 1.2725 1.1397 1.0890 1.1524 1.0677 1.0917 1.2203 1.2232 1.2826 1.4327 1.5393 1.5890 1.6890 1.6708 1.5005 1.2172 1.2165 1.0783 1.0788 1.0739 1.0713 1.0693 1.0689 1.0778 1.0687 1.0428 1.0548 1.0654 1.0882 1.0802 1.0935 1.0610 1.0618 1.0601 1.0596 1.0639 1.0592 1.0600 1.0589 1.0624 1.0364 1.0362 1.0610 1.0957 1.0981 1.1012 1.0963 1.0996 1.0977 1.0949 1.1040 1.0959 1.1033 1.0941 1.1006 1.0993 1.1004 1.0996
irintensity: 0.3537 0.0112 0.2641 0.0969 0.2336 0.7074 0.4190 0.1540 0.6372 0.2144 0.3607 0.2518 0.2920 0.0733 0.0015 0.1926 1.0772 0.2449 0.5331 2.0882 2.0709 1.4001 1.5125 0.0830 23.0000 3.9824 14.9226 0.7554 10.9814 7.8480 0.1324 1.4066 2.1390 8.5345 0.7325 9.8814 2.2389 6.6583 0.5865 1.1722 3.5777 4.8803 2.7428 0.8401 3.9733 0.1269 0.7514 1.1349 3.4098 7.1129 12.0936 5.3977 1.2108 8.0214 6.8753 1.1471 4.9712 8.5742 2.6020 3.5006 0.4518 0.8268 3.7999 1.4709 0.3865 1.8494 3.7383 4.4034 2.3714 2.4053 0.7975 0.5396 0.1566 3.6913 11.3227 12.8800 5.1425 4.3145 0.0216 0.1129 0.1540 0.4443 0.8979 3.3654 12.3672 9.2307 5.3754 2.0092 16.5170 28.8846 2.8450 5.4345 3.7846 1.0216 28.1685 40.1607 4.5088 119.3418 68.0638 36.7732 38.1623 53.7725 3.1261 1.9505 1.9973 8.7824 3.6124 4.1928 5.9564 69.7516 3.5290 132.0180 48.9159 96.2383 54.2117 88.6329 53.9665
temp: 298.150 k
press: 1.00000 atm
elementType: 17 6 6 6 6 6 6 6 6 6 6 6 6 6 1 1 1 1 1 1 1 1 1 1 1 1 1 1 1 1 1 1 1 1 1 1 1 1 1 1 1
symmnumber: 1
zpe: 976171.1 jmol-1
zpe.correction: 0.371804 hartree
zpe.thermalcorrener: 0.391178 hartree
zpe.thermalcorrenthalpy: 0.392123 hartree
zpe.thermalcorrgfe: 0.320411 hartree
zpe.sumelectzpe: -970.467416 hartree
zpe.sumelectthermal: -970.448042 hartree
zpe.sumelectthermalent: -970.447098 hartree
zpe.sumelectthermalfe: -970.518810 hartree
dipole: 0.3966 1.4591 2.0339
dipole: 2.5344
quadrupole: -99.7515 -101.3012 -97.8405
quadrupole: -4.9903 -4.9101 -2.5876
quadrupole: -0.1204 -1.6701 1.7906 -4.9903 -4.9101 -2.5876
hfenergy: -970.8392204 hartree
pointgroup: C01 [X(C13H27Cl1)]
dipole: 0.1420709 -0.5440363 -0.8234319 debye
polarizability: 185.4711805|1.1549664|135.168826|-1.845803|3.5101078|133.7917766 unknown
InChI: InChI=1S/C13H27Cl/c1-3-5-7-8-9-10-12-13(14)11-6-4-2/h13H,3-12H2,1-2H3
charge 0 multiplicity 1
41 atoms
Cl -2.703104 2.066229 1.250628
C  -0.094186 0.492221 -0.172032
C  -1.145293 1.293564 -0.970862
C  1.342931 0.742823 -0.681503
C  -2.593817 1.188668 -0.470302
C  2.41217 -0.052693 0.100341
C  -3.155337 -0.231747 -0.330638
C  3.851502 0.200188 -0.402245
C  -4.667485 -0.2955 -0.02908
C  4.922743 -0.58829 0.38437
C  -5.194939 -1.744523 0.076468
C  6.362111 -0.336699 -0.12009
C  -6.706694 -1.808777 0.382874
C  7.42668 -1.123835 0.674443
H  -0.163612 0.775457 0.896735
H  -0.316381 -0.592105 -0.23154
H  -0.855545 2.3619 -0.990807
H  -1.145567 0.947338 -2.027958
H  1.570538 1.827156 -0.611582
H  1.406691 0.480681 -1.759037
H  -3.261743 1.819496 -1.083016
H  2.348123 0.210498 1.176798
H  2.185768 -1.137551 0.032331
H  -2.948779 -0.754869 -1.290627
H  -2.593013 -0.776241 0.451136
H  4.076041 1.285668 -0.338301
H  3.916644 -0.067004 -1.478135
H  -5.226857 0.24175 -0.823735
H  -4.86886 0.24287 0.917544
H  4.860601 -0.31925 1.459803
H  4.69904 -1.674198 0.323407
H  -4.633594 -2.278343 0.870341
H  -4.985143 -2.284234 -0.870116
H  6.424216 -0.608765 -1.193844
H  6.583291 0.748796 -0.062151
H  -7.293858 -1.305799 -0.408618
H  -6.93752 -1.306382 1.340989
H  -7.061351 -2.853371 0.454647
H  7.410005 -0.843343 1.744676
H  7.24248 -2.213131 0.611596
H  8.445406 -0.930655 0.290493
