program: Gaussian 09
title: 000036705
version: EM64L-G09RevD.01
frameworkgroup: C1[X(C11H18N2)]
method: RPBEPBE
basis: SDD
operation: Freq
keyword: #pfreq=noraman
keyword: PBEPBE/SDD
title: #p freq=noraman PBEPBE/SDD
converged: NO YES NO NO
title: Mulliken charges:
elementType: N N C C C C C C C C C C C H H H H H H H H H H H H H H H H H H
charge: -0.433940 -0.032850 -0.387047 -0.394012 -0.380148 -0.366310 -0.392390 -0.382423 -0.526277 -0.530569 0.288521 0.209701 -0.475381 0.193725 0.201633 0.189030 0.190038 0.200271 0.216195 0.212423 0.185214 0.207165 0.196448 0.193190 0.195219 0.223081 0.215032 0.212851 0.193505 0.317191 0.260912
chargesum: 0.00000
title: Mulliken charges with hydrogens summed into heavy atoms:
elementType: N N C C C C C C C C C C C
charge: -0.116749 -0.032850 0.008311 -0.014943 0.036318 0.031327 0.011222 0.005987 -0.088164 -0.124213 0.288521 0.209701 -0.214469
polarizability: 1.29754696e+02 1.62070280e+00 1.39032273e+02 -8.16234348e+00 2.05498704e+00 1.01395093e+02
1716.lowfreq: -7.0677 -0.0005 0.0005 0.0005 6.9910 9.1411 73.3925 104.2981 134.0892
frequency: 73.2624 104.2084 134.0431 163.1767 191.4356 216.2654 228.9179 294.2004 312.0067 318.0803 354.4031 403.2980 430.9450 473.9617 498.2366 584.7581 600.1339 657.7805 683.8670 695.8744 716.4442 762.7395 788.6659 801.0388 823.7607 846.6059 873.5224 916.6957 923.2960 933.5817 972.0658 995.4799 1024.4228 1055.9239 1059.4642 1077.2983 1082.2359 1107.2219 1132.5416 1142.3274 1150.0859 1178.9776 1198.7225 1209.9443 1226.3661 1265.7063 1275.0361 1288.0483 1300.1785 1302.1077 1317.3838 1325.7257 1335.3847 1344.2145 1354.4638 1358.1781 1360.6678 1364.8328 1396.9866 1457.9933 1461.6347 1463.9953 1466.4468 1469.9215 1474.2161 1477.8231 1482.7637 1500.5935 1576.0608 2952.0942 2959.1732 2965.8288 2973.7471 2979.8379 2982.5482 2985.5748 2991.5307 3004.0080 3011.3816 3018.8149 3029.3223 3037.3719 3046.0361 3054.8821 3059.1368 3211.8104 3610.7619
redmass: 4.1774 3.3496 3.0030 3.2871 2.1640 2.6068 3.2557 1.9590 2.6607 2.2430 2.0633 2.0345 2.5364 2.7513 2.4604 1.9438 2.9369 2.1421 1.9759 2.2397 2.0529 2.2036 1.7552 2.1011 1.5647 1.4654 2.6274 2.5397 2.3251 2.0390 2.0373 1.7058 1.8973 2.4194 2.3886 2.5451 2.3030 1.6331 1.6854 1.6158 1.5993 1.4520 1.5006 1.4986 1.3041 1.3044 1.4078 1.3371 1.3811 1.2878 1.3211 2.2522 1.5103 1.4351 1.3858 1.4327 1.4606 1.5021 2.0771 1.1194 1.1939 1.0783 1.1214 1.2387 2.0678 1.1036 1.0833 1.0891 5.2947 1.0606 1.0608 1.0601 1.0648 1.0659 1.0650 1.0649 1.0647 1.1002 1.0986 1.1004 1.0986 1.0942 1.0969 1.0979 1.0942 1.0973 1.0818
irintensity: 0.2170 0.3582 0.1683 0.8374 0.3708 0.0911 0.7560 0.5935 0.0968 0.2082 0.7082 1.5324 5.2585 0.5964 0.5171 36.2726 3.9617 51.0777 14.2373 0.4175 8.1842 5.0562 6.4501 3.3639 2.3474 31.3059 2.4865 20.2132 9.7247 0.5051 1.1102 1.8638 0.7210 6.1818 1.0987 8.1333 1.0372 1.6426 0.9075 1.3841 4.0337 1.3974 0.3416 4.0245 5.5314 3.0310 8.8762 2.2055 3.8107 0.2765 0.2794 2.8826 0.6055 3.9654 1.6576 2.2965 0.0590 0.3540 6.3524 4.6243 6.6537 3.9814 10.5269 9.6833 5.9865 4.5369 10.9109 33.7368 6.5034 32.2077 15.6843 27.6779 57.4105 26.5236 73.1230 56.8452 41.9165 19.2558 21.9393 13.8130 74.8802 22.5234 118.7575 40.8895 59.8202 4.4343 52.6926
temp: 298.150 k
press: 1.00000 atm
elementType: 7 7 6 6 6 6 6 6 6 6 6 6 6 1 1 1 1 1 1 1 1 1 1 1 1 1 1 1 1 1 1
symmnumber: 1
zpe: 722021.1 jmol-1
zpe.correction: 0.275003 hartree
zpe.thermalcorrener: 0.286879 hartree
zpe.thermalcorrenthalpy: 0.287824 hartree
zpe.thermalcorrgfe: 0.237875 hartree
zpe.sumelectzpe: -538.440360 hartree
zpe.sumelectthermal: -538.428484 hartree
zpe.sumelectthermalent: -538.427540 hartree
zpe.sumelectthermalfe: -538.477489 hartree
dipole: -1.7820 2.0387 1.2221
dipole: 2.9707
quadrupole: -86.3619 -73.2928 -81.9777
quadrupole: 7.1388 2.2830 -1.5451
quadrupole: -5.8178 7.2513 -1.4335 7.1388 2.2830 -1.5451
hfenergy: -538.7153636 hartree
pointgroup: C01 [X(C11H18N2)]
dipole: -0.7483408 0.7543224 0.4868596 debye
polarizability: 129.4531562|1.015266|139.2032726|-8.4957705|1.5203988|101.5256332 unknown
InChI: InChI=1S/C11H18N2/c1-2-4-6-8-11-10(7-5-3-1)9-12-13-11/h9,13H,1-8H2
charge 0 multiplicity 1
31 atoms
N  2.344122 0.732336 -0.487289
N  2.810044 -0.48239 -0.97855
C  -2.352947 0.895181 0.1692
C  -2.86232 -0.428478 -0.463584
C  -1.362036 1.683735 -0.728358
C  -1.79248 -1.505763 -0.79158
C  -0.367779 2.582705 0.046537
C  -1.131465 -2.251647 0.397932
C  0.584409 1.797571 1.006552
C  -0.087779 -1.46661 1.255637
C  1.263262 0.607829 0.377694
C  0.996246 -0.777703 0.457237
C  1.973416 -1.392561 -0.393344
H  -1.882398 0.671704 1.143121
H  -3.226771 1.537429 0.400702
H  -3.393342 -0.179326 -1.406278
H  -3.624018 -0.876054 0.208744
H  -1.93121 2.310034 -1.443808
H  -0.773282 0.975769 -1.341082
H  -0.994494 -1.072417 -1.425539
H  -2.287357 -2.273436 -1.420962
H  -0.918781 3.333445 0.648371
H  0.242363 3.150781 -0.684504
H  -0.620139 -3.144832 -0.015508
H  -1.920353 -2.635046 1.077654
H  0.012483 1.440748 1.881445
H  1.340209 2.501954 1.408046
H  0.374076 -2.191948 1.955939
H  -0.605491 -0.727275 1.893252
H  2.818775 1.585768 -0.77393
H  2.116234 -2.451303 -0.606747
