program: Gaussian 09
title: 000036698
version: EM64L-G09RevD.01
frameworkgroup: C1[X(C14H14N2)]
method: RPBEPBE
basis: SDD
operation: Freq
keyword: #pfreq=noraman
keyword: PBEPBE/SDD
title: #p freq=noraman PBEPBE/SDD
converged: YES YES NO NO
title: Mulliken charges:
elementType: N N C C C C C C C C C C C C C C H H H H H H H H H H H H H H
charge: -0.549072 -0.017403 -0.508613 0.327599 -0.549323 0.307620 -0.524374 0.473450 -0.049251 -0.405099 -0.382028 -0.365295 -0.260433 -0.250357 -0.177401 -0.369940 0.224393 0.244099 0.221166 0.199426 0.243845 0.226964 0.231945 0.239313 0.275442 0.266118 0.229156 0.229065 0.229213 0.239775
chargesum: 0.00000
title: Mulliken charges with hydrogens summed into heavy atoms:
elementType: N N C C C C C C C C C C C C C C
charge: -0.007512 -0.017403 -0.284220 0.327599 -0.084059 0.307620 -0.081103 0.473450 -0.049251 -0.178135 -0.150082 -0.125982 -0.031276 -0.021292 0.051812 -0.130164
polarizability: 2.07310377e+02 2.17304008e+00 1.58500111e+02 -2.16955151e+00 5.71704907e+00 1.00464987e+02
1716.lowfreq: 0.0005 0.0007 0.0008 0.8904 7.3786 13.2002 42.3875 84.6764 108.0548
frequency: 42.1859 84.6631 108.0424 131.7459 143.3310 201.5232 225.6544 271.3498 302.9864 322.3452 329.8545 364.3392 432.2441 461.9581 484.9039 540.6236 543.7723 576.0507 588.4070 601.4451 641.1686 656.7365 693.0426 732.6694 740.8234 770.6061 785.3094 814.1249 834.1413 857.2235 877.4354 912.5533 936.9916 948.8613 973.2031 982.1282 986.6994 1019.4051 1034.6872 1056.7919 1062.1287 1084.6490 1102.4040 1132.7977 1159.9380 1162.6384 1178.8223 1195.8379 1211.0515 1230.0386 1232.5485 1247.1283 1280.8159 1314.8178 1323.8319 1339.3401 1362.2674 1366.0604 1388.0984 1427.0916 1436.2365 1445.2281 1454.7762 1469.5185 1486.1146 1564.5526 1583.5598 1584.0423 1606.8462 1634.1645 2963.6076 2986.3963 2992.6431 3023.8485 3072.5762 3102.2882 3111.0930 3124.6997 3130.7579 3135.8363 3158.9959 3164.7130 3432.2263 3562.8411
redmass: 4.5121 3.8735 4.1320 1.1779 2.6101 2.9918 3.6708 3.9886 4.0321 4.6570 3.3338 3.4528 2.5517 3.3861 4.4798 3.7120 3.4048 3.7319 2.8294 2.7334 2.3460 5.5131 4.0859 2.2305 3.7610 1.6113 1.9830 2.2050 3.4485 2.3536 1.5973 2.8230 1.3990 1.4426 2.0309 1.4792 1.3410 3.3960 2.9865 2.3763 2.5077 2.1512 2.2948 1.3592 1.1965 2.0127 1.2251 1.7866 1.5702 1.5301 1.7436 1.6713 1.4516 3.1551 1.8386 1.5125 1.4042 1.8720 2.5726 2.0817 2.2991 2.1542 1.2430 1.1309 2.1558 6.0304 5.9260 6.4457 6.0157 1.1029 1.0635 1.0845 1.0654 1.0959 1.0963 1.0876 1.0883 1.0873 1.0923 1.0916 1.1006 1.0996 1.0447 1.0964
irintensity: 0.1149 0.6875 3.4943 38.3222 11.0709 1.2910 4.2037 6.7628 3.0623 3.0930 0.4993 3.5237 4.0974 4.8341 1.3562 20.8830 4.9853 4.3250 1.9538 78.2098 145.0482 13.2096 28.9278 21.4787 2.2011 53.6054 37.9275 31.5739 1.2222 22.7761 9.5586 1.6184 0.3042 0.9465 3.7539 0.1176 0.1759 9.7607 2.5512 7.4126 2.6530 11.4367 3.2669 6.7666 1.4166 4.5252 1.1997 4.7233 8.1537 2.6388 2.0937 4.9120 4.4447 5.1413 2.5186 4.3423 1.8891 2.1903 2.4821 9.8283 1.1932 35.3732 16.2271 13.9197 25.4827 12.2591 13.8739 1.4111 0.7322 36.1788 18.1351 25.7998 31.1461 40.1486 15.4315 15.4984 6.3090 2.9772 25.8114 23.4509 36.6467 31.7545 4.4672 1.0253
temp: 298.150 k
press: 1.00000 atm
elementType: 7 7 6 6 6 6 6 6 6 6 6 6 6 6 6 6 1 1 1 1 1 1 1 1 1 1 1 1 1 1
symmnumber: 1
zpe: 646234.0 jmol-1
zpe.correction: 0.246138 hartree
zpe.thermalcorrener: 0.259102 hartree
zpe.thermalcorrenthalpy: 0.260047 hartree
zpe.thermalcorrgfe: 0.206805 hartree
zpe.sumelectzpe: -650.252886 hartree
zpe.sumelectthermal: -650.239921 hartree
zpe.sumelectthermalent: -650.238977 hartree
zpe.sumelectthermalfe: -650.292218 hartree
dipole: -1.7399 -0.8876 -0.3308
dipole: 1.9811
quadrupole: -89.5369 -89.2853 -94.6632
quadrupole: -3.7941 -5.0907 3.4670
quadrupole: 1.6249 1.8765 -3.5014 -3.7941 -5.0907 3.4670
hfenergy: -650.4990234 hartree
pointgroup: C01 [X(C14H14N2)]
dipole: 0.6860333 -0.3421027 0.1407057 debye
polarizability: 207.3464507|-1.9217711|158.1694615|-1.7304239|-7.1177493|100.7595619 unknown
InChI: InChI=1S/C14H14N2/c15-14-11-5-2-1-4-10(11)7-8-13-12(14)6-3-9-16-13/h1-6,9,14H,7-8,15H2
charge 0 multiplicity 1
30 atoms
N  -0.019469 -1.523042 -1.97179
N  -2.90175 1.197763 -0.031314
C  0.035966 -1.253783 -0.502487
C  1.329698 -0.528786 -0.049227
C  0.494799 1.970879 -0.185047
C  1.549479 0.882246 0.028438
C  -0.731237 1.638842 -1.067429
C  -1.293448 -0.654316 -0.054357
C  -1.681473 0.678352 -0.376766
C  2.415506 -1.399692 0.253065
C  2.847033 1.344316 0.385618
C  -2.219674 -1.452881 0.655256
C  3.693404 -0.925509 0.608168
C  3.912522 0.468507 0.672503
C  -3.477404 -0.92593 1.021595
C  -3.775641 0.402824 0.651169
H  0.088897 -2.255041 -0.032278
H  0.117512 2.294632 0.807407
H  1.002799 2.854696 -0.616686
H  -0.389156 1.251814 -2.046669
H  -1.298274 2.564808 -1.262687
H  2.243996 -2.48383 0.210503
H  3.016161 2.427469 0.442567
H  -1.95725 -2.485906 0.911764
H  0.832513 -1.983911 -2.314742
H  -0.241268 -0.693999 -2.53403
H  4.500933 -1.629995 0.835719
H  4.896249 0.86724 0.943885
H  -4.207782 -1.526559 1.572486
H  -4.740444 0.858493 0.902965
