program: Gaussian 09
title: 000036704
version: EM64L-G09RevD.01
frameworkgroup: C1[X(C6H13O5P)]
method: RPBEPBE
basis: SDD
operation: Freq
keyword: #p
keyword: freq=noraman
keyword: PBEPBE/SDD
title: #p freq=noraman PBEPBE/SDD
converged: YES YES NO NO
title: Mulliken charges:
elementType: P O O O O O C C C C C C H H H H H H H H H H H H H
charge: 1.308101 -0.503165 -0.540763 -0.601508 -0.389761 -0.231013 -0.804100 -0.236763 -0.217150 0.261177 -0.656728 -0.654476 0.312356 0.295457 0.245342 0.220975 0.243209 0.215506 0.207015 0.228834 0.239307 0.212806 0.227128 0.231069 0.387146
chargesum: 0.00000
title: Mulliken charges with hydrogens summed into heavy atoms:
elementType: P O O O O O C C C C C C
charge: 1.308101 -0.503165 -0.540763 -0.601508 -0.002615 -0.231013 -0.196286 0.229554 0.241564 0.261177 0.018427 0.016527
polarizability: 1.25366616e+02 2.20157903e+00 1.10941775e+02 -1.35313533e-01 -7.22599782e+00 8.92500943e+01
1716.lowfreq: -7.6331 -5.1079 -0.0023 -0.0020 0.0009 5.2237 24.4135 29.2708 41.2375
frequency: 24.0744 29.2561 41.1703 56.5814 62.3794 98.2180 104.3864 120.5100 143.6409 197.4393 225.6207 238.3947 244.8355 276.5809 296.0690 340.4892 388.2344 399.7475 427.6843 516.5169 577.8190 625.0939 665.1944 671.3671 764.5594 808.5198 816.5928 855.4505 871.6859 879.4076 894.5114 1012.7627 1021.7653 1032.0919 1082.2044 1103.4799 1109.1250 1135.3802 1135.6774 1173.5541 1244.3215 1255.5946 1262.1439 1321.0903 1358.0936 1363.9047 1393.6788 1396.0346 1410.0874 1456.2302 1459.7639 1477.3432 1478.8220 1489.2698 1492.1302 1651.5953 2988.0859 2991.1483 2995.2262 2995.6102 3054.2674 3055.9167 3065.1029 3091.3415 3091.6157 3108.5456 3111.8414 3147.9205 3520.4930
redmass: 5.3862 2.8655 2.7174 3.1983 3.5278 4.0901 2.3983 4.2861 6.9199 4.2691 5.3701 1.3971 1.2424 2.9778 4.3961 4.6363 5.9201 2.2644 5.6717 4.8891 3.4474 1.9828 2.9750 5.1028 6.1513 1.0909 1.0941 3.5946 3.8112 3.8647 2.4088 2.5507 2.5856 3.0113 2.8348 2.2111 2.3808 1.4250 1.4401 1.2277 1.2541 1.1402 1.1454 2.2448 1.2570 1.2390 1.2418 1.2485 1.1347 1.0396 1.0403 1.0505 1.0474 1.0833 1.0854 8.5483 1.0537 1.0508 1.0391 1.0419 1.1086 1.1077 1.0571 1.0982 1.0979 1.1023 1.1022 1.1068 1.0642
irintensity: 0.9764 0.1623 0.7365 1.6805 2.3198 5.2243 2.6483 2.2811 5.7008 0.4074 8.5940 2.6181 0.4323 12.5680 12.3965 11.7950 9.8014 2.6686 11.7745 116.5419 46.9598 142.0962 39.9586 65.1509 45.4485 4.3338 3.5273 52.7219 93.8062 189.5641 20.8998 117.7721 201.9856 16.3768 255.1682 5.4786 65.6082 5.1702 5.4163 26.3771 31.5741 0.2022 4.1555 92.3958 5.6953 1.8451 20.8267 28.6085 30.3887 11.5590 12.7944 7.2745 2.7515 16.1600 0.5734 250.7133 23.8536 25.9253 23.8087 29.0185 7.5869 10.5530 0.3164 24.2658 31.4425 36.1908 30.0664 0.5743 40.5391
temp: 298.150 k
press: 1.00000 atm
elementType: 15 8 8 8 8 8 6 6 6 6 6 6 1 1 1 1 1 1 1 1 1 1 1 1 1
symmnumber: 1
zpe: 509581.0 jmol-1
zpe.correction: 0.194089 hartree
zpe.thermalcorrener: 0.209859 hartree
zpe.thermalcorrenthalpy: 0.210803 hartree
zpe.thermalcorrgfe: 0.148311 hartree
zpe.sumelectzpe: -952.792343 hartree
zpe.sumelectthermal: -952.776574 hartree
zpe.sumelectthermalent: -952.775629 hartree
zpe.sumelectthermalfe: -952.838121 hartree
dipole: -1.0833 0.9072 -3.1480
dipole: 3.4506
quadrupole: -65.8281 -76.7565 -88.6054
quadrupole: -4.9757 3.2119 4.2220
quadrupole: 11.2353 0.3068 -11.5421 -4.9757 3.2119 4.2220
hfenergy: -952.9864326 hartree
pointgroup: C01 [X(C6H13O5P1)]
dipole: 0.4985124 -0.4071159 -1.1952917 debye
dipolederiv: 2.2005747 0.1144604 0.1459804 -0.0811613 1.9411543 0.0839821 -0.0092439 -0.1759545 1.3646975 -0.6203508 -0.1160165 -0.0463669 -0.1603843 -1.4381591 -0.175795 -0.0892604 -0.316432 -0.534147 -1.7534854 -0.1079173 0.019472 0.0252498 -0.5589939 -0.0288911 -0.0013883 0.0381212 -0.5298242 -0.7083348 -0.0134708 -0.0379796 0.038833 -0.6643119 -0.0422642 -0.0097534 -0.0360203 -0.6436377 -0.6505262 0.4828756 0.1533741 0.425976 -0.773121 -0.1962371 0.2722732 -0.3064952 -0.5001813 -0.7605723 -0.1702337 -0.1698164 -0.105858 -0.7764632 -0.2916906 0.0495935 -0.21017 -0.4092289 -0.8138985 0.051229 -0.1596468 -0.0095959 -0.2537001 0.0124562 -0.1690245 0.0592825 -0.2580319 0.3151196 -0.0309806 0.0114268 0.0715074 0.7503704 0.1374014 0.0817151 0.5093636 0.2914465 1.0548834 0.0535219 0.0166918 0.0261562 0.3115172 -0.0206224 0.4195039 0.0098348 0.2237413 1.5453188 -0.1838208 0.042579 -0.0090994 1.1717489 0.5777021 -0.4645341 0.6020646 0.3983042 0.0458214 -0.018036 0.0105721 -0.0408714 -0.1666914 0.0513067 0.000122 -0.0311292 0.0483681 -0.1790504 -0.0292867 0.0849533 -0.0098352 0.0603596 0.0240747 0.0141658 0.0126118 0.003074 0.0907626 0.0233045 -0.0082067 -0.0354327 0.011892 0.0062317 0.0224729 0.0294142 0.1200488 0.0786599 0.0062069 -0.0056191 -0.009786 0.1040269 -0.0676995 0.0504484 -0.0498696 0.0318576 0.0170546 -0.0111038 -0.0873624 0.0117361 0.0073295 0.0363614 -0.0686933 -0.0366292 -0.0392546 -0.093725 0.0207493 0.1086427 -0.0302165 -0.0042688 0.0032499 0.0648588 -0.061106 -0.0025208 -0.0032117 0.0232168 0.031921 -0.0227125 -0.0155587 -0.0952861 -0.0690938 -0.0845109 -0.0169606 -0.056952 -0.0117912 0.0031433 0.0410863 -0.099095 0.1195486 -0.0684297 0.0858644 0.0002275 0.1131361 -0.0102795 0.0044843 -0.016204 -0.0948848 -0.0996295 0.0019238 -0.1212462 -0.0241838 -0.0267722 0.0453051 -0.118125 0.0142088 0.0890984 0.01953 -0.1003809 0.0798936 -0.0041922 -0.0758355 -0.0165761 0.0946074 0.0271642 0.1080247 -0.0062733 0.0897334 0.0374728 0.0514546 -0.1566999 -0.0109224 -0.0700054 -0.0074549 0.116336 0.0045708 -0.0797934 0.0037825 0.0413245 0.1199161 -0.0222211 -0.0167708 0.0027185 -0.0371374 -0.1256253 0.0381508 -0.1007823 -0.019329 0.11579 0.0508951 -0.0193917 0.0124227 -0.0822717 0.1029234 0.0265888 0.090706 0.0342171 0.2023774 -0.1191083 0.0114426 -0.1584471 0.2927991 -0.0293249 -0.0019546 -0.0280668 0.3727305 unknown
polarizability: 125.1929074|2.0754591|111.6335628|1.9365877|6.3167666|88.7320153 unknown
InChI: InChI=1S/C6H13O5P/c1-3-10-12(9,11-4-2)5-6(7)8/h7H,3-5H2,1-2H3
charge 0 multiplicity 1
25 atoms
P  0.206788 0.615954 0.2900
O  -0.263212 -1.020377 0.614966
O  1.677345 0.52122 -0.643773
O  0.281988 1.478289 1.618899
O  -3.022885 1.906139 -0.244244
O  -2.921487 -0.139017 -1.347017
C  -0.896531 1.24341 -1.120959
C  -0.24299 -2.050123 -0.474705
C  2.980145 0.533759 0.09009
C  -2.354745 0.900945 -0.942193
C  -0.499863 -3.387077 0.213579
C  4.064244 0.744632 -0.962637
H  -0.74374 2.332566 -1.155057
H  -0.513382 0.770134 -2.037166
H  -1.040579 -1.811454 -1.203103
H  0.743234 -2.025472 -0.97643
H  2.960274 1.347452 0.838779
H  3.101466 -0.432342 0.616428
H  -0.510995 -4.199374 -0.537075
H  0.285906 -3.603067 0.957064
H  -1.474975 -3.373818 0.728432
H  5.059252 0.750251 -0.480284
H  4.044755 -0.06387 -1.713254
H  3.921334 1.707813 -1.481079
H  -3.971546 1.641828 -0.097062
