program: Gaussian 09
title: 000036721
version: EM64L-G09RevD.01
frameworkgroup: C1[X(C16H33Cl)]
method: RPBEPBE
basis: SDD
operation: Freq
keyword: #p
keyword: freq=noraman
keyword: PBEPBE/SDD
title: #p freq=noraman PBEPBE/SDD
converged: YES YES NO NO
title: Mulliken charges:
elementType: Cl C C C C C C C C C C C C C C C C H H H H H H H H H H H H H H H H H H H H H H H H H H H H H H H H H
charge: -0.116070 -0.389520 -0.386805 -0.385550 -0.386219 -0.371321 -0.384867 -0.360055 -0.382023 -0.342420 -0.372924 -0.329181 -0.353277 -0.349405 -0.356836 -0.696888 -0.696710 0.199374 0.193719 0.192641 0.194469 0.197829 0.189947 0.194904 0.193259 0.189042 0.224650 0.193022 0.192536 0.229410 0.192240 0.191696 0.192351 0.255411 0.189224 0.189160 0.221914 0.188226 0.187782 0.187507 0.190832 0.225252 0.194652 0.194651 0.205960 0.214000 0.220263 0.209603 0.209755 0.214792
chargesum: 0.00000
title: Mulliken charges with hydrogens summed into heavy atoms:
elementType: Cl C C C C C C C C C C C C C C C C
charge: -0.116070 0.003573 0.000305 0.002225 0.001944 0.042370 0.000691 0.061595 0.002024 -0.087009 0.005459 0.080959 0.022012 0.066679 0.032467 -0.056665 -0.062560
polarizability: 2.43362631e+02 -2.82185869e+00 1.66162674e+02 1.27117561e-01 -5.90211456e-01 1.47649042e+02
1716.lowfreq: -24.5280 -6.1600 -0.0030 -0.0024 0.0007 6.6555 7.1942 8.1251 23.3399
frequency: -13.3836 7.9580 23.2679 29.5641 46.3425 56.4776 58.9325 76.0174 86.5854 90.0236 105.5944 109.0899 122.3639 126.7892 142.2624 148.0748 152.6364 164.1700 210.1614 231.4150 231.7538 255.2831 271.6852 297.3532 331.3724 387.4502 393.1622 453.5944 475.9376 501.4977 528.6224 542.3396 717.0907 718.4326 722.1142 729.8206 739.0192 754.1439 784.4149 824.7331 860.0483 881.7836 887.6008 891.0799 929.2045 971.2613 979.4081 985.1100 996.7534 1016.9313 1023.1423 1024.9028 1040.2117 1053.6278 1065.6573 1066.9122 1077.4894 1080.7341 1081.9786 1083.4653 1100.8048 1112.8843 1127.2602 1135.1543 1180.4318 1197.2350 1199.6070 1208.4545 1220.8828 1227.2899 1242.6279 1247.2643 1259.0455 1264.3474 1274.1646 1276.2741 1281.1107 1284.7910 1286.3603 1288.6064 1293.5679 1294.9643 1302.6414 1307.3238 1320.9279 1335.9312 1348.5511 1352.6175 1355.2580 1356.3553 1361.0202 1361.3746 1387.5254 1390.9177 1436.8267 1448.8202 1457.7018 1457.8603 1460.8253 1461.2750 1463.4458 1467.4829 1472.7049 1473.8193 1476.9643 1477.8868 1478.3344 1482.6027 1485.4771 1486.3254 1488.1312 2946.8401 2947.7973 2948.0191 2949.3471 2950.3466 2950.9993 2953.9920 2957.2472 2958.5386 2962.9889 2967.1231 2967.8496 2971.0959 2972.8682 2976.7731 2981.4421 2984.0302 2988.0738 2993.7879 3001.7850 3011.6946 3015.7212 3017.4454 3023.7356 3033.2697 3038.9826 3041.5442 3046.3868 3054.9937 3068.0615 3069.7660 3072.3671 3074.9761
redmass: 1.8228 3.9323 4.0079 3.7978 1.6302 3.2094 3.3328 1.9456 1.7585 2.5479 3.6748 3.0772 1.7822 2.9569 2.5293 1.9497 2.2200 3.4329 3.2764 1.1300 1.1158 3.2988 4.0884 3.0203 3.2439 3.7006 2.9240 2.8188 3.2838 2.8814 3.0262 3.5827 1.0575 1.0655 1.0816 1.1108 1.1217 1.1519 1.2010 1.2355 1.2597 1.2986 1.8877 1.8658 1.2692 2.4885 2.1348 2.6767 3.5651 1.7208 2.2603 1.9823 1.6243 2.3262 2.2817 2.5679 2.0096 2.0887 2.1942 2.1229 1.8117 2.1036 2.9130 2.2285 1.9026 1.5910 1.2808 1.4328 1.3832 1.3461 1.3282 1.2698 1.2690 1.2847 1.1990 1.0336 1.0703 1.2233 1.1575 1.0956 1.1154 1.1107 1.2170 1.1907 1.3519 1.4130 1.5016 1.7147 1.6421 1.6358 1.6194 1.6733 1.2172 1.2174 1.0808 1.0778 1.0729 1.0729 1.0696 1.0669 1.0724 1.0844 1.0853 1.0568 1.0426 1.0871 1.0426 1.0909 1.0764 1.0937 1.0942 1.0612 1.0588 1.0596 1.0598 1.0591 1.0596 1.0595 1.0621 1.0594 1.0594 1.0625 1.0601 1.0365 1.0361 1.0645 1.0960 1.0966 1.0978 1.0996 1.1017 1.1005 1.0951 1.0918 1.1043 1.1040 1.0962 1.1038 1.0998 1.0976 1.1007 1.0993 1.1009 1.0991
irintensity: 0.2855 0.1013 0.0536 0.1769 0.0295 0.1441 0.1241 0.2874 0.0821 0.1207 0.5108 0.4131 0.0416 0.0347 0.3641 0.0192 0.3267 0.1159 1.0407 0.0226 0.0041 0.8776 0.1297 1.0316 1.9368 0.1760 2.4682 0.9876 0.7055 0.2237 0.7184 23.4400 20.8094 0.2149 4.3298 2.4211 6.3590 11.0436 1.6903 3.7447 2.4950 2.1958 3.7987 6.8792 4.1392 3.2881 0.2199 0.4391 3.7919 0.4973 1.7515 1.9103 0.6847 0.2113 0.7787 0.3788 3.1564 0.0796 0.3803 0.4684 2.8477 19.4526 5.3483 9.4067 0.1553 3.2916 23.3997 5.9901 0.5761 1.6208 1.9236 2.3626 5.2566 0.1084 2.2329 0.3163 1.9093 0.0952 0.5119 0.8517 0.1743 0.1714 3.2083 2.2669 0.3696 1.1204 0.1357 0.2675 0.7472 0.1154 3.7576 2.0619 11.0855 9.7093 0.3453 6.9843 0.0090 0.0661 0.0262 0.0499 0.1238 0.6562 0.9814 3.6743 12.2963 1.4734 13.1282 1.5072 12.6841 4.9446 41.0727 2.0866 0.1730 0.8993 1.7629 0.8313 1.0843 1.9394 35.8890 0.8768 62.4563 2.1511 292.5565 38.3175 48.4964 28.9115 0.7102 1.5440 1.9752 1.9733 1.7093 2.3648 2.6979 2.5511 6.4937 0.3258 13.0145 172.2847 69.0181 109.5218 97.9394 56.4103 89.8083 50.7691
temp: 298.150 k
press: 1.00000 atm
elementType: 17 6 6 6 6 6 6 6 6 6 6 6 6 6 6 6 6 1 1 1 1 1 1 1 1 1 1 1 1 1 1 1 1 1 1 1 1 1 1 1 1 1 1 1 1 1 1 1 1 1
symmnumber: 1
zpe: 1194499.9 jmol-1
zpe.correction: 0.454961 hartree
zpe.thermalcorrener: 0.477797 hartree
zpe.thermalcorrenthalpy: 0.478741 hartree
zpe.thermalcorrgfe: 0.398175 hartree
zpe.sumelectzpe: -1088.137556 hartree
zpe.sumelectthermal: -1088.114721 hartree
zpe.sumelectthermalent: -1088.113776 hartree
zpe.sumelectthermalfe: -1088.194342 hartree
dipole: -0.3135 -2.3806 0.6050
dipole: 2.4762
quadrupole: -121.3776 -121.5090 -116.3126
quadrupole: -12.3146 3.6686 -0.8123
quadrupole: -1.6445 -1.7759 3.4205 -12.3146 3.6686 -0.8123
hfenergy: -1088.5925171 hartree
pointgroup: C01 [X(C16H33Cl1)]
dipole: 0.1071337 0.907788 0.3369627 debye
polarizability: 243.4322704|-1.6126389|165.7610049|0.164548|2.5164324|147.9810719 unknown
InChI: InChI=1S/C16H33Cl/c1-3-5-6-7-8-9-10-11-12-13-15-16(17)14-4-2/h16H,3-15H2,1-2H3
charge 0 multiplicity 1
50 atoms
Cl -5.629227 -1.978435 -0.601929
C  -0.303808 -0.334177 0.178309
C  0.985316 0.425443 -0.207868
C  -1.596228 0.410646 -0.224837
C  2.27877 -0.326777 0.178556
C  -2.882773 -0.339788 0.187048
C  3.567948 0.440925 -0.191467
C  -4.165116 0.404286 -0.241803
C  4.8616 -0.317129 0.18285
C  -5.478359 -0.23672 0.223041
C  6.151082 0.454167 -0.179165
C  -6.736039 0.568023 -0.129246
C  7.444747 -0.30756 0.187728
C  -8.054215 0.004022 0.443864
C  8.734515 0.464872 -0.172633
C  -9.273144 0.876518 0.075203
C  10.021537 -0.305564 0.194221
H  -0.296211 -1.336487 -0.298156
H  -0.309408 -0.511686 1.274269
H  0.982564 1.423127 0.279388
H  0.985421 0.614443 -1.301955
H  -1.599336 0.567055 -1.323925
H  -1.593433 1.422299 0.233435
H  2.287467 -1.31896 -0.319294
H  2.273382 -0.527806 1.270518
H  -2.889207 -0.481457 1.288205
H  -2.884278 -1.351882 -0.260868
H  3.569294 0.650292 -1.281888
H  3.563342 1.429384 0.314099
H  -4.189021 0.517312 -1.343531
H  -4.14479 1.433031 0.180638
H  4.857756 -0.532621 1.272072
H  4.868908 -1.302755 -0.328026
H  -5.446679 -0.491067 1.297756
H  6.152523 0.674414 -1.267499
H  6.146485 1.437588 0.336184
H  -6.80903 0.657772 -1.231043
H  -6.582264 1.597535 0.262242
H  7.451512 -1.290106 -0.329201
H  7.444447 -0.529751 1.275664
H  -7.97008 -0.073127 1.547261
H  -8.199725 -1.025008 0.06549
H  8.732948 0.688269 -1.259244
H  8.728258 1.445538 0.345739
H  -9.161843 1.908159 0.460096
H  -9.3971 0.939078 -1.02237
H  -10.206107 0.458824 0.495245
H  10.063235 -0.512372 1.280466
H  10.06448 -1.277447 -0.33291
H  10.928682 0.265964 -0.07603
