program: Gaussian 09
title: 000000724
version: EM64L-G09RevD.01
frameworkgroup: C1[X(C3H7O7P)]
method: RPBEPBE
basis: SDD
operation: Freq
keyword: #pfreq=noraman
keyword: PBEPBE/SDD
title: #p freq=noraman PBEPBE/SDD
converged: YES YES NO NO
title: Mulliken charges:
elementType: P O O O O O O O C C C H H H H H H H
charge: 1.396918 -0.540312 -0.444084 -0.682818 -0.672289 -0.405126 -0.576262 -0.226786 -0.223842 -0.143287 0.177458 0.261303 0.252122 0.257130 0.370714 0.406320 0.399769 0.393072
chargesum: 0.00000
title: Mulliken charges with hydrogens summed into heavy atoms:
elementType: P O O O O O O O C C C
charge: 1.396918 -0.540312 -0.073370 -0.276498 -0.272519 -0.012054 -0.576262 -0.226786 0.289584 0.113843 0.177458
polarizability: 8.22456222e+01 -2.08631890e+00 7.30212539e+01 -8.51008609e-01 1.04824990e+00 7.87196009e+01
1716.lowfreq: -6.1676 -5.8025 -0.0020 -0.0019 -0.0019 7.5581 20.3551 31.5228 66.3265
frequency: 20.1751 31.4093 66.3185 75.3157 120.1911 144.9090 175.1387 222.1393 242.8279 290.1973 302.5865 327.2408 339.0705 355.1509 377.6476 399.8145 437.5578 489.1468 572.7001 603.5099 639.2839 698.8830 726.5725 739.6521 850.1203 896.0255 945.9611 1006.1611 1015.2112 1043.0380 1052.1409 1090.3714 1092.8962 1194.1489 1247.1399 1288.6920 1302.2461 1359.3513 1390.7568 1452.6490 1663.7232 3020.9692 3031.5876 3106.6324 3500.1321 3521.8967 3593.8938 3613.4230
redmass: 6.7721 7.3531 9.9891 6.4906 7.1893 5.0581 1.4616 2.8897 3.1381 2.2690 3.7607 2.2516 3.2884 4.3426 1.7279 5.2731 4.8387 3.1039 2.9733 2.7398 3.0856 6.7184 10.1384 4.8130 5.0685 2.5067 4.8039 1.3001 1.2274 2.9354 2.6063 2.0965 6.8514 1.1156 1.3254 1.6316 1.5967 1.2113 1.5357 1.0809 9.5228 1.0670 1.0728 1.1096 1.0653 1.0643 1.0662 1.0665
irintensity: 5.7154 2.2577 4.0662 0.4167 5.7763 3.5016 89.9508 32.8991 27.4225 66.0744 76.8021 104.0015 37.4743 73.1498 59.6218 24.6965 20.9965 29.3117 45.8281 27.7746 92.4508 171.7731 239.2980 44.3757 73.5110 16.9804 158.9558 28.3066 121.3169 258.8110 89.4434 20.0970 183.2557 29.7248 0.6561 46.8540 34.4299 9.2907 11.0445 16.5120 215.5936 4.0855 29.3828 8.1608 30.7898 35.2777 69.3916 73.6815
temp: 298.150 k
press: 1.00000 atm
elementType: 15 8 8 8 8 8 8 8 6 6 6 1 1 1 1 1 1 1
symmnumber: 1
zpe: 309094.7 jmol-1
zpe.correction: 0.117728 hartree
zpe.thermalcorrener: 0.131219 hartree
zpe.thermalcorrenthalpy: 0.132163 hartree
zpe.thermalcorrgfe: 0.075849 hartree
zpe.sumelectzpe: -985.406649 hartree
zpe.sumelectthermal: -985.393158 hartree
zpe.sumelectthermalent: -985.392214 hartree
zpe.sumelectthermalfe: -985.448528 hartree
dipole: -0.6049 0.0346 -3.0659
dipole: 3.1251
quadrupole: -63.7743 -69.7026 -75.1171
quadrupole: -10.6406 2.1063 6.1112
quadrupole: 5.7571 -0.1713 -5.5858 -10.6406 2.1063 6.1112
hfenergy: -985.5243771 hartree
pointgroup: C01 [X(C3H7O7P1)]
dipole: -0.1940775 -0.1402296 -1.2059861 debye
dipolederiv: 2.4051228 0.0282973 -0.2504439 0.0461471 1.9476984 0.079217 0.0979289 0.0122088 1.7181381 -1.3647827 -0.1301762 0.3518053 -0.2306776 -0.5329861 0.0994775 0.5384215 0.0909256 -0.6736273 -0.6247438 -0.0014958 -0.0297143 -0.1113629 -0.6297248 -0.2142558 -0.1105103 -0.193834 -0.3371599 -0.5535035 -0.1552516 -0.089124 -0.2079711 -0.7920485 -0.1468245 -0.2214199 -0.2010082 -0.9331505 -0.8967451 0.1688409 0.0033912 0.2339886 -1.0052725 0.1035483 -0.0619412 0.2006834 -0.4190671 -0.4856068 0.1715324 0.1451407 0.2071359 -1.0347463 -0.3901691 0.1004187 -0.3008477 -0.4140987 -0.703729 -0.0294484 0.0564587 -0.0002558 -0.6184137 0.0090438 0.0388159 0.0381319 -0.6419959 -0.4404821 0.0319353 -0.1965383 0.1511574 -0.593988 -0.0241566 -0.2117437 -0.2752094 -0.844895 0.5150325 -0.0129914 -0.1923993 0.2098129 0.2280839 -0.0396602 -0.5707101 -0.1340267 0.4445847 0.2395119 0.0982924 -0.0640124 0.1737758 0.4373229 0.2087759 -0.0177866 0.3461965 0.1671242 0.5598289 -0.2497449 0.1955523 -0.4701994 1.1635685 0.266789 0.3012368 0.3963987 1.1091725 -0.0060993 0.065016 -0.0499153 0.0191328 0.0118226 0.078207 0.0557265 0.0603855 0.0197383 0.0358023 -0.0265817 0.040177 -0.0117193 -0.0215319 -0.0878357 0.0898977 -0.0385979 -0.0107816 -0.0165347 0.0004252 0.081808 -0.0343636 0.0431964 -0.0128538 0.0557332 -0.0467281 -0.0359789 0.4064707 -0.0463019 0.0134833 -0.0050336 0.3682591 0.10329 0.0446152 0.0282464 0.1529367 0.1533184 0.0440354 0.0422997 0.0138492 0.3939915 -0.0001002 -0.008478 -0.0308858 0.3660996 0.404639 0.0002031 0.0215767 -0.0096228 0.3217266 -0.0823692 -0.0104988 -0.0369498 0.1565473 0.3725005 0.0434137 -0.0795452 0.0262065 0.3130419 0.0498767 -0.1097057 0.0849106 0.1764133 unknown
polarizability: 82.5389992|-1.5854861|73.0782321|-0.6006332|1.5765274|78.3692458 unknown
InChI: InChI=1S/C3H7O7P/c4-2(3(5)6)1-10-11(7,8)9/h2,4-5,7-8H,1H2
charge 0 multiplicity 1
18 atoms
P  -2.264951 -0.371521 0.176693
O  -0.571752 -0.178505 0.139987
O  1.441566 2.014494 -0.052115
O  -2.467422 -1.317844 -1.23807
O  -2.949914 1.106403 -0.416439
O  2.43501 -1.500872 -0.393051
O  -2.82278 -0.878112 1.563782
O  2.491782 -0.052571 1.431998
C  0.122194 0.209621 -1.118073
C  1.508848 0.714717 -0.689538
C  2.192482 -0.292987 0.244227
H  -0.423709 1.02878 -1.618419
H  0.195503 -0.674684 -1.772743
H  2.122359 0.81886 -1.604299
H  1.499236 1.878228 0.932168
H  -3.400105 -1.450543 -1.541008
H  -3.187344 1.76194 0.288226
H  2.835096 -2.153802 0.242474
