program: Gaussian 09
title: 000036679
version: EM64L-G09RevD.01
frameworkgroup: C1[X(C12H18N2O)]
method: RPBEPBE
basis: SDD
operation: Freq
keyword: #p
keyword: freq=noraman
keyword: PBEPBE/SDD
title: #p freq=noraman PBEPBE/SDD
converged: NO YES NO NO
title: Mulliken charges:
elementType: O N N C C C C C C C C C C C C H H H H H H H H H H H H H H H H H H
charge: -0.317736 -0.499594 -0.166101 -0.238592 0.578538 -0.692518 -0.692595 -0.461292 -0.404268 0.471227 -0.454392 -0.361469 0.298948 -0.631905 -0.670279 0.204627 0.212515 0.208783 0.225920 0.225892 0.208797 0.212542 0.229577 0.226225 0.208191 0.306722 0.318776 0.222748 0.222871 0.289808 0.247737 0.235216 0.235082
chargesum: 0.00000
title: Mulliken charges with hydrogens summed into heavy atoms:
elementType: O N N C C C C C C C C C C C C
charge: -0.317736 -0.180818 -0.166101 -0.033964 0.578538 -0.045300 -0.045364 -0.231715 -0.178044 0.471227 -0.246201 -0.054747 0.298948 0.103521 0.047756
polarizability: 2.37419394e+02 -2.04793451e+00 1.40268814e+02 4.05834356e-02 -2.26099046e-01 9.03023987e+01
1716.lowfreq: -4.8150 -2.1905 -0.0008 -0.0007 -0.0004 4.2318 24.2590 40.7396 43.3324
frequency: 23.9001 40.6713 43.3088 75.7458 95.9797 106.2817 121.2944 167.3936 180.8375 202.4774 216.3520 230.7396 248.0367 251.8760 292.6314 344.2132 381.4955 408.3616 414.3052 424.7620 476.5644 543.6014 563.3251 566.6854 602.1087 641.0392 702.4265 721.8409 741.1011 819.5203 835.4092 856.1279 862.2344 889.5693 914.3417 939.5636 952.6897 988.3639 1001.8515 1009.1836 1051.2706 1060.1551 1093.9556 1114.2667 1118.0245 1134.6288 1153.9868 1161.3652 1190.7048 1220.0131 1253.3702 1269.5251 1290.5093 1305.9894 1324.2565 1346.5556 1375.8586 1384.5067 1394.4962 1413.8943 1417.1872 1448.4807 1464.9657 1468.1748 1478.3651 1480.1627 1481.0051 1483.7343 1494.2006 1495.9804 1503.3077 1516.7029 1591.9334 1622.2675 1629.2790 2935.1822 2961.7503 2972.6618 2973.5252 2976.2232 3002.2264 3034.5703 3065.6539 3072.2330 3075.6047 3080.5767 3095.1852 3097.0526 3113.8036 3121.0072 3128.4303 3190.8690 3549.8579
redmass: 2.8713 3.0553 3.1846 2.0814 3.9935 2.3567 2.4101 1.2010 3.1216 1.3767 1.5310 1.5381 2.0173 3.0571 3.2080 2.8863 4.4813 2.9531 3.7816 3.0358 3.0934 1.8532 3.4142 1.4397 4.7758 6.7814 11.2777 3.6819 3.4915 1.4352 5.4351 6.3909 1.4428 2.5798 1.1803 1.3675 1.4685 1.3255 3.0380 2.5067 1.5158 1.4135 1.2331 2.5423 1.5119 1.3296 1.7128 2.3573 1.1213 1.8678 4.1329 2.2914 1.6240 1.3264 2.4489 2.2158 1.1953 3.0891 1.2180 3.1216 1.1711 1.1825 1.0448 1.0516 1.0509 1.0581 1.0875 1.0939 1.0468 1.1690 2.0494 2.5226 5.6550 4.2340 6.2385 1.0384 1.0366 1.0348 1.0739 1.0446 1.1018 1.1024 1.1000 1.0992 1.1004 1.0994 1.0876 1.0940 1.0960 1.0902 1.0951 1.0941 1.0752
irintensity: 1.7909 0.8733 0.2470 6.7225 2.8168 0.3508 1.4489 0.0033 0.1263 0.6988 1.4819 0.5487 0.5054 3.0706 6.2883 0.8543 18.9920 0.0006 2.7195 1.2685 1.2819 77.3374 3.8433 13.8098 0.2624 2.4654 20.1966 1.4717 1.8895 38.5987 0.5017 1.6551 42.0330 2.8533 2.8475 0.0646 0.0680 3.2453 44.6269 10.3281 34.4015 19.1169 0.0458 1.8176 39.6684 0.2177 0.9907 183.7268 19.9298 2.0281 53.9166 52.3108 3.2712 1.1323 41.8128 146.5485 15.9552 99.6848 17.0409 66.9517 27.0510 30.1686 1.4141 4.1141 14.8681 34.4037 60.1836 1.5981 7.1284 211.0560 18.4815 497.7037 47.4903 143.7126 131.9465 55.9771 112.7621 33.8390 27.6460 37.0160 41.4492 46.5846 0.3818 112.4834 25.4806 42.8663 31.7793 14.9103 0.8377 28.8093 16.4603 6.5108 10.0288
temp: 298.150 k
press: 1.00000 atm
elementType: 8 7 7 6 6 6 6 6 6 6 6 6 6 6 6 1 1 1 1 1 1 1 1 1 1 1 1 1 1 1 1 1 1
symmnumber: 1
zpe: 733177.5 jmol-1
zpe.correction: 0.279253 hartree
zpe.thermalcorrener: 0.295796 hartree
zpe.thermalcorrenthalpy: 0.296740 hartree
zpe.thermalcorrgfe: 0.233971 hartree
zpe.sumelectzpe: -651.678571 hartree
zpe.sumelectthermal: -651.662027 hartree
zpe.sumelectthermalent: -651.661083 hartree
zpe.sumelectthermalfe: -651.723852 hartree
dipole: -2.2593 3.9827 -0.0003
dipole: 4.5789
quadrupole: -67.3326 -88.2789 -95.4945
quadrupole: -10.0878 -0.0117 -0.0510
quadrupole: 16.3694 -4.5769 -11.7925 -10.0878 -0.0117 -0.0510
hfenergy: -651.9578235 hartree
pointgroup: C01 [X(C12H18N2O1)]
dipole: -0.8610155 -1.5823874 0.0015004 debye
polarizability: 237.3165145|3.7650763|140.3712908|-0.0666764|-0.2664992|90.3028023 unknown
InChI: InChI=1S/C12H18N2O/c1-9(2)10-5-7-11(8-6-10)13-12(15)14(3)4/h5-9,13H,1-4H3
charge 0 multiplicity 1
33 atoms
O  -2.441413 1.680308 0.001773
N  -1.706085 -0.561504 0.006728
N  -4.012576 -0.058238 -0.002976
C  4.099872 -0.120921 -0.000108
C  2.571285 -0.211089 0.001314
C  4.634062 0.590719 1.272266
C  4.632923 0.572402 -1.283004
C  1.914035 -1.466421 0.011315
C  1.755513 0.950191 -0.006813
C  -0.293362 -0.384691 0.004816
C  0.507577 -1.558459 0.01302
C  0.347535 0.883699 -0.005112
C  -2.697561 0.434924 0.001151
C  -5.117934 0.912226 0.006206
C  -4.343106 -1.4900 -0.011313
H  4.4928 -1.158307 0.007246
H  4.281438 1.637926 1.31711
H  5.740295 0.60576 1.276498
H  4.288616 0.080167 2.189299
H  4.28755 0.048123 -2.192293
H  5.739136 0.588363 -1.287949
H  4.279304 1.618507 -1.343131
H  2.510513 -2.387476 0.017768
H  2.225212 1.941766 -0.014443
H  0.028651 -2.547456 0.020745
H  -0.265215 1.786777 -0.010631
H  -2.010659 -1.535342 0.016518
H  -5.751205 0.786465 0.905936
H  -5.751825 0.802904 -0.895232
H  -4.681102 1.922524 0.014705
H  -5.438552 -1.601365 -0.039635
H  -3.985674 -2.012085 0.900939
H  -3.940548 -2.009198 -0.905812
