program: Gaussian 09
title: 000036701
version: EM64L-G09RevD.01
frameworkgroup: C1[X(C8H10Br3N3O)]
method: RPBEPBE
basis: SDD
operation: Freq
keyword: #p
keyword: freq=noraman
keyword: PBEPBE/SDD
title: #p freq=noraman PBEPBE/SDD
converged: YES YES NO NO
title: Mulliken charges:
elementType: Br Br Br O N N N C C C C C C C C H H H H H H H H H H
charge: 0.098088 0.080563 0.078591 -0.261999 -0.132971 -0.124857 -0.006858 -0.165799 0.251389 -0.667108 -0.049036 -0.610274 -0.618698 -0.106743 -0.207708 0.252279 0.242128 0.257998 0.216376 0.256451 0.232142 0.244086 0.232960 0.283934 0.225065
chargesum: 0.00000
title: Mulliken charges with hydrogens summed into heavy atoms:
elementType: Br Br Br O N N N C C C C C C C C
charge: 0.098088 0.080563 0.078591 -0.261999 -0.132971 -0.124857 -0.006858 0.086480 0.251389 0.049395 -0.049036 0.122404 0.123262 -0.106743 -0.207708
polarizability: 1.80576567e+02 -2.98006171e+00 1.74827905e+02 -1.32098921e+01 -1.34110754e+00 1.10725215e+02
1716.lowfreq: -5.5167 -2.7203 -0.0006 -0.0006 0.0002 2.4058 21.9311 37.3788 54.1109
frequency: 21.9156 37.3687 54.0872 58.6978 94.4666 95.8542 111.0626 113.8327 135.7904 146.0434 178.7265 196.4387 220.0820 227.9925 243.3634 251.6925 267.9936 336.7326 364.3241 381.2760 413.8849 438.6229 502.0931 516.7916 560.5550 625.4228 643.3207 649.8994 753.9507 769.3645 927.2282 947.6363 991.9762 1003.6249 1054.9996 1067.1373 1087.3294 1090.4394 1137.8732 1150.9705 1169.1622 1240.7874 1281.3226 1285.7933 1323.6513 1348.3031 1369.9689 1379.6823 1393.6274 1412.8496 1442.1138 1452.8533 1458.0537 1466.4306 1472.2486 1478.1897 1487.2759 1497.6590 1608.1574 2968.8375 2975.7788 3007.3685 3010.8115 3052.5267 3057.2619 3103.4792 3109.3847 3125.2382 3127.8296
redmass: 5.3986 6.2353 4.3390 9.3234 4.2067 21.6962 11.1518 5.3512 1.3784 1.2597 2.5719 1.0432 4.9857 68.5914 4.6936 4.0920 3.7757 4.2277 7.1546 3.9480 3.4667 13.0962 3.8891 9.3187 5.5482 9.5851 6.5759 12.0731 3.7351 3.3279 4.1508 5.7637 3.5477 2.8917 1.3960 1.5554 1.3602 1.9936 1.3941 2.5527 4.5746 5.4683 1.6634 9.1760 1.6132 9.1888 3.9781 2.9578 1.2454 1.1658 1.1705 8.5533 1.0729 1.0631 1.0543 1.0796 1.0515 1.1677 7.3249 1.0389 1.0369 1.0386 1.0802 1.1016 1.0963 1.0984 1.1002 1.0976 1.1006
irintensity: 0.6449 1.2380 2.0094 1.1760 2.9363 0.3616 0.1506 0.3054 0.8895 0.2095 2.8181 0.0952 1.3186 0.1270 0.7865 3.2477 2.5825 4.1108 9.7219 10.2488 1.0847 4.1242 6.6835 7.8833 1.8581 0.0391 8.5281 0.2342 7.7809 3.2784 20.7891 71.5152 1.7427 7.6835 10.9080 15.5708 12.2427 57.2666 3.1089 31.2705 53.2604 25.7900 10.6950 17.7121 9.8107 170.1764 57.7233 24.6549 41.5319 36.6436 9.9134 50.6127 4.1852 11.3482 10.0654 18.0435 29.8053 30.2998 271.6170 35.8438 65.5480 16.6897 9.5940 44.2120 21.2169 21.5110 17.6593 1.3235 10.9867
temp: 298.150 k
press: 1.00000 atm
elementType: 35 35 35 8 7 7 7 6 6 6 6 6 6 6 6 1 1 1 1 1 1 1 1 1 1
symmnumber: 1
zpe: 460427.7 jmol-1
zpe.correction: 0.175368 hartree
zpe.thermalcorrener: 0.192792 hartree
zpe.thermalcorrenthalpy: 0.193736 hartree
zpe.thermalcorrgfe: 0.126236 hartree
zpe.sumelectzpe: -589.529818 hartree
zpe.sumelectthermal: -589.512394 hartree
zpe.sumelectthermalent: -589.511450 hartree
zpe.sumelectthermalfe: -589.578950 hartree
dipole: 0.5310 -2.7856 3.2188
dipole: 4.2898
quadrupole: -121.7757 -113.7748 -112.4194
quadrupole: -5.9708 12.1474 5.6086
quadrupole: -5.7857 2.2152 3.5705 -5.9708 12.1474 5.6086
hfenergy: -589.7051856 hartree
pointgroup: C01 [X(C8H10Br3N3O1)]
dipole: 0.3080837 -1.1907799 1.1556555 debye
dipolederiv: 0.0060553 -0.0195656 0.0204126 -0.0365081 -0.5359481 0.024322 0.0246182 0.0318695 0.060068 -0.3896336 -0.0531743 0.1737887 -0.1083374 0.0332057 0.0441429 0.211219 0.0281251 -0.0226257 -0.0642254 0.1590879 0.0270052 0.2202074 -0.4666584 -0.0623604 0.0361818 -0.0664464 0.0164561 -0.6913889 -0.115361 0.3534152 -0.2166402 -0.3749442 0.2497361 0.0355606 0.0060793 -1.0317091 -0.6743777 0.283848 0.235879 0.1184139 -0.4964761 -0.0754835 0.136278 -0.1474163 -0.2287025 -0.5846926 -0.0848803 -0.2917344 -0.1264806 -0.3511801 -0.0616682 -0.1020437 -0.019835 -1.0324379 -0.478373 -0.0301018 0.1196959 -0.2833398 -0.3560234 0.1159397 0.1505418 0.0376789 -0.1803667 0.4586051 -0.21768 -0.1736601 -0.4095247 0.1366955 0.0792494 -0.1178372 0.071146 0.351671 0.8400654 0.2287809 -0.0223223 0.3872041 0.2402563 -0.1343183 0.1584267 -0.0164702 1.5689056 -0.0851297 0.0431591 0.0177511 0.0798823 0.0419999 -0.0185668 0.0208244 -0.0138475 -0.081797 0.3467767 -0.0131246 -0.1801663 0.0601755 0.9236413 -0.0167214 -0.1916196 -0.0379352 -0.0139081 0.2279534 -0.0517676 -0.1475202 -0.0681505 0.1527294 -0.1238172 -0.1128823 -0.0588615 0.339554 0.3740656 0.0421063 0.2153868 0.0760317 0.2655652 0.1335818 0.0699973 0.060547 0.0230596 0.5969951 0.1773676 -0.3087542 0.4375971 -0.4903611 -0.1780307 -0.3146436 -0.0690918 0.0401514 0.0344359 -0.450592 -0.004611 -0.2764487 1.1489996 0.0505405 -0.0382801 0.1680285 -0.0564599 0.0093101 0.0060736 0.0109111 0.0692766 -0.0147561 0.056908 0.0095585 0.0770492 -0.0003642 -0.0316496 0.0895252 0.0759251 0.0883851 0.0696064 -0.0193473 0.0944586 -0.0379575 0.0459221 0.1213731 0.0249111 -0.0027017 0.0325573 -0.0345288 0.0745198 -0.0351582 0.0142697 0.0722857 -0.0515834 -0.1141283 -0.07816 -0.1154393 0.015524 -0.0419089 -0.0441244 -0.0002316 0.0668469 -0.0254507 0.0585893 0.1333518 0.1150818 -0.0201027 -0.0520089 0.1055165 0.0137328 -0.0064845 -0.0544091 0.0462406 -0.1335374 0.0159715 0.1097848 0.0364568 -0.08369 0.0457659 -0.0766615 0.0511624 -0.09959 0.0310543 -0.1259399 -0.0566909 -0.0232642 0.020196 -0.0755466 0.0661556 0.0133602 0.0873669 0.0270087 -0.0066492 -0.0480494 -0.1382511 -0.0104035 -0.1306059 0.0118533 0.1123599 -0.0212116 0.0226565 -0.018308 0.1070526 0.0179787 0.1368157 0.0886741 0.0605337 -0.0616046 0.0241206 -0.1210746 0.0909823 0.0006582 0.0623712 -0.1595106 0.0312794 0.0080544 unknown
polarizability: 171.9851279|-1.8320514|175.3291162|-25.634648|4.7880789|118.8154429 unknown
InChI: InChI=1S/C8H10Br3N3O/c1-4(8(15)13(2)3)14-7(11)5(9)6(10)12-14/h4H,1-3H3
charge 0 multiplicity 1
25 atoms
Br -1.446534 -2.982436 0.313497
Br -3.950383 -0.380419 1.347125
Br -2.281845 2.909294 0.532333
O  2.995255 0.376063 -1.491316
N  -0.177712 -0.422559 -0.299813
N  2.615146 0.033055 0.780962
N  -0.347248 0.963844 -0.269191
C  1.049026 -0.99469 -0.907769
C  2.294422 -0.12097 -0.559471
C  0.88935 -1.134079 -2.431255
C  -1.292586 -1.075172 0.197466
C  1.84042 -0.508698 1.909481
C  3.719906 0.943416 1.139696
C  -2.224916 -0.09224 0.578297
C  -1.58645 1.143266 0.267302
H  1.173172 -1.996747 -0.453843
H  1.797365 -1.586702 -2.860936
H  0.761949 -0.141043 -2.88985
H  0.018045 -1.769743 -2.668025
H  1.069412 0.20608 2.258875
H  2.529488 -0.714118 2.74764
H  1.3458 -1.457319 1.647922
H  3.338478 1.794506 1.735543
H  4.172835 1.322996 0.212144
H  4.486106 0.407118 1.730286
