program: Gaussian 09
title: 000036676
version: EM64L-G09RevD.01
frameworkgroup: C1[X(C18H22)]
method: RPBEPBE
basis: SDD
operation: Freq
keyword: #p
keyword: freq=noraman
keyword: PBEPBE/SDD
title: #p freq=noraman PBEPBE/SDD
converged: NO YES NO NO
title: Mulliken charges:
elementType: C C C C C C C C C C C C C C C C C C H H H H H H H H H H H H H H H H H H H H H H
charge: -0.589543 -0.589573 0.543342 0.543307 -0.611028 -0.611104 0.332793 0.332837 -0.429188 -0.429089 0.317784 0.317773 -0.417467 -0.417494 -0.819858 -0.819855 -0.809620 -0.809622 0.220790 0.220418 0.220809 0.220432 0.234555 0.234537 0.230463 0.230447 0.225347 0.225361 0.228719 0.224144 0.223888 0.224147 0.223888 0.228722 0.223568 0.223755 0.227149 0.223750 0.227145 0.223571
chargesum: 0.00000
title: Mulliken charges with hydrogens summed into heavy atoms:
elementType: C C C C C C C C C C C C C C C C C C
charge: -0.148335 -0.148332 0.543342 0.543307 -0.376473 -0.376567 0.332793 0.332837 -0.198726 -0.198642 0.317784 0.317773 -0.192119 -0.192133 -0.143106 -0.143098 -0.135147 -0.135157
polarizability: 2.86891384e+02 4.05831874e-04 1.96994214e+02 -1.69175674e+01 6.96155932e-04 1.08889899e+02
1716.lowfreq: -8.5957 -0.0003 0.0004 0.0008 5.0331 12.8714 15.8228 22.9596 36.5939
frequency: 15.8225 22.9400 36.5479 40.6834 81.6043 114.5848 114.6478 147.5680 153.3244 158.4184 163.6342 211.8177 230.8720 255.6212 286.4611 289.7787 303.2498 320.1698 368.0753 426.7449 437.7115 446.8864 447.2901 464.2263 501.2317 544.8742 547.2583 590.8700 606.0401 713.7165 717.2082 729.8939 737.2790 739.6955 772.0319 788.6113 832.3000 834.6077 892.1092 898.5374 920.4977 937.2876 953.2936 953.9088 978.8696 990.4638 998.0776 998.0997 1009.7839 1019.8471 1029.8878 1029.9706 1053.2901 1053.3328 1122.6201 1128.3070 1136.6524 1166.6730 1168.1687 1217.6528 1217.6655 1254.8336 1257.5521 1267.3864 1272.5312 1289.6154 1295.6187 1324.3487 1371.7025 1373.3111 1391.6400 1391.6552 1403.6118 1403.6709 1409.7113 1410.9068 1460.6663 1460.7240 1470.0563 1470.2775 1472.8820 1474.3278 1474.4055 1477.2802 1477.5893 1487.9520 1500.5636 1500.7812 1584.5610 1584.7790 1624.3822 1624.5647 2965.6075 2965.8206 2967.0345 2967.0520 2981.9426 2990.6334 3029.1234 3036.1894 3036.2251 3040.2171 3040.2250 3056.4127 3079.1767 3079.2380 3081.6975 3081.7289 3102.5751 3103.1156 3108.0357 3108.3179 3133.1762 3133.4212
redmass: 3.4551 3.6851 3.1893 3.5338 4.0679 1.0678 1.0668 2.1675 1.1661 1.3588 2.3746 2.8007 2.8086 2.0301 2.5409 2.4721 2.7213 3.7962 3.6640 2.9342 2.8037 2.7940 2.7112 4.0343 3.7594 4.0154 4.7449 3.1393 4.3674 5.1732 3.3175 2.7203 4.1458 4.0977 2.3642 1.2198 1.3519 1.6039 1.4676 1.3783 2.8745 2.3813 1.4392 1.3476 1.7045 1.6352 1.4815 1.8786 2.6999 1.6323 1.4533 1.4494 1.6431 1.6431 1.5298 2.0359 1.5358 1.5768 1.4517 1.8208 1.8498 2.0045 3.2318 1.2362 1.7769 1.3789 1.4740 1.4497 5.3258 5.5408 1.2380 1.2377 1.3006 1.3219 2.4609 2.4543 1.0472 1.0472 1.1900 1.1907 1.1139 1.0489 1.0486 1.1590 1.1483 1.1010 2.4470 2.4955 6.3914 6.3866 6.4577 6.3958 1.0372 1.0372 1.0381 1.0381 1.0590 1.0598 1.1010 1.0969 1.0969 1.0968 1.0968 1.1049 1.0985 1.0985 1.0977 1.0977 1.0908 1.0909 1.0867 1.0867 1.0967 1.0968
irintensity: 0.0077 0.0237 0.1785 0.3489 0.0001 0.0088 0.0004 0.0000 3.3356 0.0002 0.1032 0.0002 8.1882 0.1262 0.0048 0.2376 1.0524 0.0115 0.7959 0.8368 0.0247 12.3460 0.0069 0.3372 1.0513 1.0204 0.1128 17.4042 0.0015 0.9642 0.0196 8.8419 0.0115 0.1657 0.0024 0.2675 55.4987 0.0168 0.0738 12.1085 0.2957 0.0378 0.0188 1.0724 0.1154 0.2296 25.2922 4.4154 2.9598 3.8110 0.0060 30.8460 0.0002 0.0038 2.8233 4.2270 3.2227 0.0476 9.3591 0.6575 0.0463 5.3450 0.8980 0.1552 3.2759 0.3660 0.5994 0.0624 0.8806 0.1049 2.6062 9.5988 20.5110 10.1217 0.0238 1.2052 0.0073 0.0064 39.1009 4.6092 2.4904 0.5101 57.1895 2.2648 0.2939 12.5512 0.2478 76.8044 7.0290 1.3089 11.1379 5.7730 131.7660 17.3053 0.9165 29.8160 0.0156 65.3388 0.0220 0.9634 94.4499 0.0178 0.7797 25.7231 22.4515 53.5906 6.4623 3.7535 11.2015 35.9749 39.0081 1.2280 0.4319 49.1562
temp: 298.150 k
press: 1.00000 atm
elementType: 6 6 6 6 6 6 6 6 6 6 6 6 6 6 6 6 6 6 1 1 1 1 1 1 1 1 1 1 1 1 1 1 1 1 1 1 1 1 1 1
symmnumber: 1
zpe: 899712.3 jmol-1
zpe.correction: 0.342682 hartree
zpe.thermalcorrener: 0.361404 hartree
zpe.thermalcorrenthalpy: 0.362348 hartree
zpe.thermalcorrgfe: 0.293530 hartree
zpe.sumelectzpe: -697.819931 hartree
zpe.sumelectthermal: -697.801209 hartree
zpe.sumelectthermalent: -697.800265 hartree
zpe.sumelectthermalfe: -697.869084 hartree
dipole: 0.0000 0.7206 0.0001
dipole: 0.7206
quadrupole: -92.9229 -99.8291 -115.0355
quadrupole: -0.0003 -3.5005 -0.0003
quadrupole: 9.6729 2.7667 -12.4397 -0.0003 -3.5005 -0.0003
hfenergy: -698.1626134 hartree
pointgroup: C01 [X(C18H22)]
dipole: -0.0000481 -0.2835216 -0.0003081 debye
polarizability: 286.6382799|-0.0302579|196.9941438|18.1986762|0.0798802|109.143074 unknown
InChI: InChI=1S/C18H22/c1-13-5-7-17(11-15(13)3)9-10-18-8-6-14(2)16(4)12-18/h5-8,11-12H,9-10H2,1-4H3
charge 0 multiplicity 1
40 atoms
C  -0.405344 0.298432 0.670504
C  0.40423 0.299005 -0.666978
C  -1.908608 0.29993 0.438614
C  1.907416 0.299882 -0.434628
C  -2.628731 -0.914482 0.308866
C  2.627442 -0.914849 -0.306986
C  -4.020704 -0.946736 0.05183
C  4.019381 -0.947804 -0.049805
C  -2.626345 1.513121 0.303417
C  2.625401 1.512706 -0.297076
C  -4.731972 0.28508 -0.083489
C  4.730742 0.283668 0.087861
C  -4.014867 1.499433 0.046687
C  4.01387 1.498364 -0.040128
C  -4.745387 -2.275933 -0.072072
C  4.743763 -2.277349 0.071731
C  -6.226428 0.29863 -0.354924
C  6.225212 0.296484 0.359463
H  -0.106018 1.186773 1.259346
H  -0.105818 -0.590673 1.258308
H  0.105317 1.188001 -1.25499
H  0.104723 -0.589444 -1.255723
H  -2.089447 -1.865534 0.416897
H  2.088086 -1.86566 -0.416776
H  -2.099048 2.470141 0.405609
H  2.098301 2.470019 -0.397566
H  -4.556563 2.448658 -0.050363
H  4.555696 2.44731 0.058787
H  -4.051541 -3.12361 0.060143
H  -5.548428 -2.374589 0.684147
H  -5.229784 -2.385561 -1.062013
H  5.546764 -2.374811 -0.68469
H  5.228179 -2.388843 1.061453
H  4.04976 -3.124661 -0.061988
H  -6.475478 -0.222205 -1.300091
H  -6.792681 -0.213758 0.447167
H  -6.607215 1.331705 -0.429161
H  6.791451 -0.214642 -0.443442
H  6.606204 1.329364 0.435473
H  6.474071 -0.225963 1.303788
