program: Gaussian 09
title: 000036664
version: EM64L-G09RevD.01
frameworkgroup: C1[X(C9H9ClO2)]
method: RPBEPBE
basis: SDD
operation: Freq
keyword: #p
keyword: freq=noraman
keyword: PBEPBE/SDD
title: #p freq=noraman PBEPBE/SDD
converged: YES YES NO NO
title: Mulliken charges:
elementType: Cl O O C C C C C C C C C H H H H H H H H H
charge: -0.075835 -0.287686 -0.250731 0.542161 0.240019 -0.354163 -0.348745 -0.341960 -0.326161 -0.772444 0.181247 -0.499901 0.242709 0.241181 0.273080 0.274349 0.270739 0.270895 0.233153 0.244400 0.243691
chargesum: 0.00000
title: Mulliken charges with hydrogens summed into heavy atoms:
elementType: Cl O O C C C C C C C C C
charge: -0.075835 -0.287686 -0.250731 0.542161 0.240019 -0.111454 -0.107563 -0.068880 -0.051811 -0.230810 0.181247 0.221344
polarizability: 1.81041732e+02 2.25481854e-01 1.05019451e+02 1.96474513e+00 2.56017136e+00 6.60665580e+01
1716.lowfreq: -4.4007 -3.3386 -0.0008 -0.0004 0.0007 1.7022 34.3355 50.5620 67.4123
frequency: 34.2977 50.5236 67.4101 107.7277 127.8386 138.7555 186.0229 278.1376 296.9107 332.0333 353.5692 404.6345 465.5539 488.4450 609.5087 616.5000 632.3885 684.5350 749.2236 768.3421 816.3738 860.1476 873.6980 904.6041 921.7354 987.8078 997.5282 1012.9964 1069.7183 1101.9842 1114.8153 1135.8861 1149.5874 1187.5986 1230.1878 1246.3001 1256.2279 1309.3310 1390.2485 1411.4513 1424.6011 1452.7875 1462.9529 1463.7834 1501.4211 1577.0958 1620.8791 1626.2783 3005.6773 3067.4673 3107.5716 3136.4784 3138.6907 3149.0178 3150.4338 3165.7402 3181.3871
redmass: 6.1553 5.9435 4.9507 1.3327 2.9481 3.6725 5.8146 3.8997 5.6354 3.0587 5.8900 2.8396 5.4366 4.4358 5.2763 5.8859 6.8365 3.7972 5.1556 4.5894 5.1625 1.2626 1.7192 1.6010 6.3072 1.3612 1.3765 3.1634 4.2607 1.2791 1.2639 1.1260 1.4753 1.1264 2.4824 1.2465 4.5145 1.2785 6.4124 3.2124 1.1878 1.0494 1.1231 1.0521 2.6574 7.4553 6.6054 9.3756 1.0295 1.0575 1.1045 1.0901 1.0901 1.1111 1.1048 1.0959 1.0951
irintensity: 2.0091 0.6806 1.0500 1.5393 1.7023 2.7178 8.3523 10.3736 3.4989 7.5962 9.5317 0.0142 2.7879 14.7087 3.3976 61.6391 1.1006 52.3978 13.2038 2.5274 15.2448 1.4829 38.3420 0.0584 4.7553 0.9793 0.2795 25.6349 194.2157 5.9463 0.0383 3.4143 59.8702 29.1345 53.7898 77.5522 194.7669 0.2091 2.6756 19.2014 29.1995 14.4969 6.1507 12.0443 4.4931 21.5847 15.5624 187.3350 38.9108 21.6006 25.8118 7.3856 7.4438 6.8245 15.7235 4.8826 1.7302
temp: 298.150 k
press: 1.00000 atm
elementType: 17 8 8 6 6 6 6 6 6 6 6 6 1 1 1 1 1 1 1 1 1
symmnumber: 1
zpe: 416317.5 jmol-1
zpe.correction: 0.158567 hartree
zpe.thermalcorrener: 0.170351 hartree
zpe.thermalcorrenthalpy: 0.171295 hartree
zpe.thermalcorrgfe: 0.118729 hartree
zpe.sumelectzpe: -957.995259 hartree
zpe.sumelectthermal: -957.983475 hartree
zpe.sumelectthermalent: -957.982530 hartree
zpe.sumelectthermalfe: -958.035097 hartree
dipole: 1.0722 -1.4759 -2.0134
dipole: 2.7169
quadrupole: -74.2498 -74.1680 -77.8577
quadrupole: -9.9014 8.1442 -0.0681
quadrupole: 1.1753 1.2572 -2.4325 -9.9014 8.1442 -0.0681
hfenergy: -958.1538258 hartree
pointgroup: C01 [X(C9H9Cl1O2)]
dipole: -0.3843879 -0.6095377 0.7894941 debye
dipolederiv: -0.6634071 0.0408212 0.1441974 0.0682355 -0.1805454 -0.0275476 0.5086647 -0.0496592 -0.4353202 -1.2963521 -0.3637787 -0.0545612 -0.7430956 -0.8550514 -0.0267865 -0.0634285 -0.0068374 -0.2978846 -0.8923841 0.2626916 -0.0445101 0.1117817 -0.8405492 0.0239159 -0.0628289 0.0518721 -0.328903 -0.0701863 0.0043558 -0.0182038 -0.0003576 0.0683677 -0.0086228 -0.1704547 0.0009669 -0.1025673 -0.6691762 0.0263571 -0.0210993 0.014255 -0.023214 -0.0006041 -0.0631717 0.0024507 -0.0069694 -0.1191834 0.1920879 0.0104429 0.1254466 0.0155002 0.0090185 -0.0119644 0.0001937 -0.1417082 -0.170276 -0.1601103 0.0240389 -0.1093783 0.0548514 -0.0303712 -0.005338 -0.0171499 -0.1389961 0.0437024 -0.1574986 0.0193027 0.0742557 0.0198529 0.0089437 0.0101626 -0.0246661 -0.0953108 0.0749835 0.1390219 0.004694 -0.0574942 -0.011093 -0.0190438 0.0203828 0.0121941 -0.097762 0.8430148 -0.0563401 -0.2245319 -0.0732409 0.1888615 0.0407989 -0.3963135 0.0503501 0.5667705 2.0061428 0.0235672 0.1058392 0.4999025 1.3379128 -0.0085782 0.1520474 -0.0535829 0.2468069 0.7415049 0.1591633 0.0258771 0.1095103 0.2568936 0.0098722 0.0422401 0.0172944 0.2820019 0.0060866 -0.097694 -0.0148282 -0.0877198 -0.017266 0.0040778 -0.0052615 0.0011501 0.142682 0.0320735 0.0853051 -0.0233823 0.0820077 -0.0429523 0.0167863 -0.0129637 0.0175581 0.1397092 0.1003084 0.0698733 -0.0066304 0.0426968 0.0142076 0.010474 -0.0096411 0.0144055 0.1530387 0.0882659 -0.0646055 -0.0001139 -0.0735212 0.019263 0.0027341 -0.0033894 0.001816 0.154838 0.0095818 0.0094358 0.0400986 0.0843142 -0.0184119 0.0857783 0.0395966 0.0522282 -0.0355734 -0.0023704 -0.0093122 0.0287994 -0.0836157 -0.0227884 -0.091465 0.0396796 -0.0586373 -0.0178229 0.0313367 -0.0417964 -0.0057257 -0.1146495 -0.0932602 0.0014909 -0.0029715 0.0070458 0.1209051 -0.0368446 -0.0385615 -0.0181715 0.0517533 0.0731743 0.0956673 -0.070851 0.0522147 -0.0715053 -0.0568211 -0.0229827 0.028468 0.0789135 0.0562468 -0.0965388 0.065804 -0.0712077 -0.0364291 unknown
polarizability: 180.9405631|-0.6123997|105.1622717|-3.8864599|-1.0189834|66.0249055 unknown
InChI: InChI=1S/C9H9ClO2/c1-12-9(11)8-4-2-7(6-10)3-5-8/h2-5H,6H2,1H3
charge 0 multiplicity 1
21 atoms
Cl 4.454152 -0.308277 -1.1944
O  -2.845509 -0.925451 -0.077439
O  -2.794334 1.401504 -0.189319
C  2.108136 -0.034847 0.363268
C  -0.710541 0.154361 0.077936
C  1.481912 1.232594 0.228053
C  1.304151 -1.205304 0.352342
C  0.085384 1.329039 0.087691
C  -0.09363 -1.116499 0.210864
C  3.596615 -0.136425 0.515336
C  -2.1865 0.308626 -0.074061
C  -4.317543 -0.858074 -0.232906
H  2.095388 2.140794 0.227868
H  1.781625 -2.187132 0.449313
H  -0.411244 2.299082 -0.015996
H  -0.715712 -2.015245 0.202084
H  3.916332 -1.035854 1.059989
H  4.051213 0.766022 0.947508
H  -4.649991 -1.905188 -0.212148
H  -4.577814 -0.375736 -1.189976
H  -4.762892 -0.28119 0.594892
