program: Gaussian 09
title: 000036668
version: EM64L-G09RevD.01
frameworkgroup: C1[X(C10H20O)]
method: RPBEPBE
basis: SDD
operation: Freq
keyword: #pfreq=noraman
keyword: PBEPBE/SDD
title: #p freq=noraman PBEPBE/SDD
converged: YES YES NO NO
title: Mulliken charges:
elementType: O C C C C C C C C C C H H H H H H H H H H H H H H H H H H H H
charge: -0.266351 -0.344545 -0.387924 -0.350557 -0.256459 -0.226521 -0.693869 -0.476603 -0.126766 -0.167041 -0.735411 0.182510 0.183964 0.205888 0.209307 0.196315 0.196914 0.181618 0.178239 0.177036 0.186341 0.209212 0.209005 0.216510 0.220755 0.190761 0.211374 0.215921 0.219233 0.222944 0.218202
chargesum: 0.00000
title: Mulliken charges with hydrogens summed into heavy atoms:
elementType: O C C C C C C C C C C
charge: -0.266351 0.021929 0.027271 0.042672 0.103398 0.136856 -0.059143 -0.065088 0.084608 0.048880 -0.075032
polarizability: 1.31605843e+02 -5.84761392e+00 1.17508833e+02 2.13800803e+00 -4.67301239e+00 9.45169742e+01
1716.lowfreq: -5.4674 -2.8952 0.0005 0.0006 0.0008 8.4233 26.2397 37.6868 50.5258
frequency: 26.1654 37.5048 49.5557 70.5976 78.6169 101.7916 117.2466 147.1559 177.5474 184.9706 193.7413 232.8487 245.9961 283.3516 328.2697 385.4289 466.4660 478.4916 514.5780 731.4767 745.1453 770.0243 826.0418 851.4837 874.8154 894.7785 949.4262 968.2702 970.0641 977.8295 1008.9808 1026.5621 1044.6286 1065.1282 1073.5561 1079.4407 1101.7339 1123.0412 1133.8037 1152.7916 1197.3219 1202.4344 1230.8344 1251.5721 1257.3653 1278.3762 1281.6218 1290.3765 1294.6289 1315.9238 1342.9646 1345.8063 1356.9842 1390.4065 1392.4964 1403.7157 1442.3197 1461.6522 1467.8558 1468.1170 1471.9798 1473.5026 1477.6158 1480.3147 1487.5279 1493.8461 1697.2394 2894.6045 2906.3930 2943.4750 2947.1188 2953.6249 2962.7835 2965.6634 2969.8869 2971.8385 2990.4742 2993.8780 3023.7645 3036.9887 3042.6000 3055.1978 3066.3645 3068.8123 3069.3116 3071.0339 3092.1122
redmass: 3.7284 1.9288 1.7649 2.1353 3.3606 2.1576 2.4073 2.4309 2.2659 2.0588 1.6017 1.1099 3.2882 2.7951 2.4675 3.0168 2.8844 2.5799 2.8764 1.0705 1.4625 1.1083 2.5501 1.1779 1.7465 1.8323 1.7197 1.1483 1.1391 2.5308 2.8685 2.7054 1.5330 3.4671 2.4876 2.9156 2.6804 2.1935 1.9522 1.5820 1.3544 1.3925 1.1788 1.2912 1.2408 1.0877 1.2302 1.0989 1.2703 1.3132 1.4613 1.3163 1.6160 1.2173 1.2428 1.4549 1.0973 1.0475 1.0726 1.0741 1.0620 1.0698 1.0424 1.0693 1.0815 1.0886 6.2755 1.0545 1.0543 1.1045 1.1004 1.0587 1.0367 1.0702 1.0566 1.0389 1.0599 1.0982 1.1029 1.0971 1.0936 1.1041 1.0938 1.1009 1.0946 1.0992 1.0925
irintensity: 0.2014 0.0701 0.5250 0.1222 0.7344 4.9444 0.8431 3.9749 0.7912 1.3547 1.1329 0.0081 0.6810 0.6867 1.7743 0.9272 1.3178 2.5107 5.7022 10.5263 0.6665 0.0104 4.4611 0.9267 0.7886 11.6356 15.5170 6.2247 49.7924 36.6785 10.9200 19.0357 0.1590 48.3654 40.2912 43.0851 18.1307 6.6953 0.1183 1.9294 0.6589 2.9567 2.7394 2.1062 0.0205 0.3444 1.2723 0.5564 2.1229 3.6774 2.0859 38.0585 2.7157 12.4067 10.7527 1.2356 15.8885 14.0178 0.8069 3.6520 15.3145 9.2054 12.4135 0.0684 7.7760 12.0956 0.7207 22.1614 126.6989 78.9140 23.7807 18.9132 51.4094 72.3810 60.9994 27.4211 43.6137 3.5138 13.7512 31.3209 11.4784 43.7787 25.5370 108.3664 15.1584 52.7539 69.7560
temp: 298.150 k
press: 1.00000 atm
elementType: 8 6 6 6 6 6 6 6 6 6 6 1 1 1 1 1 1 1 1 1 1 1 1 1 1 1 1 1 1 1 1
symmnumber: 1
zpe: 728346.8 jmol-1
zpe.correction: 0.277413 hartree
zpe.thermalcorrener: 0.292305 hartree
zpe.thermalcorrenthalpy: 0.293249 hartree
zpe.thermalcorrgfe: 0.233282 hartree
zpe.sumelectzpe: -467.327673 hartree
zpe.sumelectthermal: -467.312781 hartree
zpe.sumelectthermalent: -467.311836 hartree
zpe.sumelectthermalfe: -467.371803 hartree
dipole: 0.4454 -0.9376 0.7817
dipole: 1.2994
quadrupole: -69.8490 -66.3047 -68.9925
quadrupole: -0.1715 -0.8081 -0.6515
quadrupole: -1.4669 2.0774 -0.6104 -0.1715 -0.8081 -0.6515
hfenergy: -467.6050854 hartree
pointgroup: C01 [X(C10H20O1)]
dipole: -0.1717965 -0.3768516 -0.2996949 debye
polarizability: 131.4724266|6.077036|117.8287619|1.8189408|4.2283388|94.3304622 unknown
InChI: InChI=1S/C10H20O/c1-3-5-7-9-11-10-8-6-4-2/h3,5H,4,6-10H2,1-2H3
charge 0 multiplicity 1
31 atoms
O  0.441624 -0.741535 0.252811
C  -3.307522 -0.170096 -0.218683
C  -1.854342 0.035029 0.266162
C  -4.278942 0.902613 0.325025
C  -0.89888 -1.03797 -0.264438
C  1.437416 -1.730731 -0.166929
C  -5.731711 0.697665 -0.15533
C  2.810318 -1.290676 0.370575
C  3.362738 -0.054503 -0.308601
C  3.738988 1.083032 0.329323
C  4.301483 2.315598 -0.343408
H  -3.666552 -1.174277 0.091039
H  -3.337057 -0.157203 -1.328625
H  -1.818489 0.023293 1.372894
H  -1.482713 1.027626 -0.054063
H  -4.248381 0.891135 1.43351
H  -3.922584 1.905948 0.01505
H  -0.885201 -1.03644 -1.379186
H  -1.223068 -2.051458 0.069811
H  1.458537 -1.807082 -1.2791
H  1.168078 -2.733075 0.238731
H  -5.794073 0.737001 -1.259454
H  -6.121025 -0.286743 0.166935
H  -6.405388 1.475711 0.248583
H  2.724193 -1.122776 1.46032
H  3.508744 -2.142252 0.224007
H  3.459342 -0.108107 -1.405707
H  3.622258 1.133408 1.423169
H  4.377124 2.179496 -1.437067
H  3.663274 3.200428 -0.151455
H  5.310713 2.560237 0.042602
