program: Gaussian 09
title: 000036654
version: EM64L-G09RevD.01
frameworkgroup: C1[X(C8H12O2)]
method: RPBEPBE
basis: SDD
operation: Freq
keyword: #pfreq=noraman
keyword: PBEPBE/SDD
title: #p freq=noraman PBEPBE/SDD
converged: NO YES NO NO
title: Mulliken charges:
elementType: O O C C C C C C C C H H H H H H H H H H H H
charge: -0.262800 -0.172384 -0.346141 -0.505986 -0.343280 0.414569 -0.405412 -0.530433 -0.692561 0.152202 0.200136 0.225924 0.220574 0.222023 0.197672 0.193736 0.259742 0.264289 0.264572 0.217494 0.215440 0.210621
chargesum: 0.00000
title: Mulliken charges with hydrogens summed into heavy atoms:
elementType: O O C C C C C C C C
charge: -0.262800 -0.172384 0.079919 -0.063388 0.048129 0.414569 -0.145670 -0.001571 -0.049006 0.152202
polarizability: 1.16440437e+02 2.93538491e-01 8.85014015e+01 -6.72393627e+00 3.62388167e+00 6.66509811e+01
1716.lowfreq: -7.0140 -0.0005 -0.0004 -0.0004 6.7260 8.5584 48.4430 65.6487 72.7473
frequency: 48.3632 65.6180 72.7288 119.5555 165.7175 223.8012 225.4952 269.0486 306.8162 390.1067 483.1969 509.4464 585.1367 627.6280 707.2994 732.0095 749.9269 777.4544 801.5532 872.6531 898.0994 920.7470 936.2560 987.8183 1009.3359 1044.9731 1070.0772 1087.3074 1107.6616 1125.1154 1180.8937 1203.3315 1245.9109 1264.5992 1268.8547 1289.3799 1300.6920 1328.2832 1353.1564 1391.2672 1420.3456 1451.9852 1469.2359 1477.2941 1477.6085 1488.3618 1675.8249 1730.3150 2964.5685 2975.2820 2976.3059 2987.9164 3002.6986 3008.7909 3035.3561 3049.3441 3060.3524 3073.5351 3075.2386 3217.1961
redmass: 3.1259 1.8053 4.2668 2.2577 5.2404 2.5378 1.1603 2.4976 3.7595 2.8652 4.4245 2.8257 4.8249 6.3574 4.6130 1.0891 1.2048 2.1667 1.9585 8.5882 1.7751 1.3219 2.2518 1.6690 4.0853 4.2702 2.5474 1.4436 2.0725 1.1735 3.3804 1.5315 1.4233 1.3455 1.6583 1.1024 1.4084 1.4332 1.5635 1.2127 1.0851 1.0970 1.0641 1.0591 1.0520 1.0829 8.0442 12.6693 1.0590 1.0446 1.0533 1.0611 1.0610 1.0985 1.0991 1.0997 1.1026 1.1008 1.0997 1.0978
irintensity: 3.3676 0.4719 0.7592 0.7150 0.2857 3.9272 0.9081 4.3362 0.2822 2.8328 3.9638 4.3130 3.2194 3.3636 5.3620 8.7780 40.9456 28.1340 35.1314 115.5522 4.0181 1.1492 0.1098 47.8710 3.2953 149.5885 0.9953 7.3209 11.8473 1.6814 40.7116 0.4316 12.8084 6.8665 12.6282 1.4006 12.9308 2.5771 0.5275 12.0737 21.5285 5.5321 0.8635 6.5572 9.9019 19.2293 57.3021 318.7850 29.7888 22.1839 11.2394 58.0722 8.9657 11.0527 0.9465 3.2414 16.7617 90.3182 58.4604 4.2554
temp: 298.150 k
press: 1.00000 atm
elementType: 8 8 6 6 6 6 6 6 6 6 1 1 1 1 1 1 1 1 1 1 1 1
symmnumber: 1
zpe: 480688.7 jmol-1
zpe.correction: 0.183085 hartree
zpe.thermalcorrener: 0.193713 hartree
zpe.thermalcorrenthalpy: 0.194657 hartree
zpe.thermalcorrgfe: 0.145892 hartree
zpe.sumelectzpe: -461.708718 hartree
zpe.sumelectthermal: -461.698090 hartree
zpe.sumelectthermalent: -461.697146 hartree
zpe.sumelectthermalfe: -461.745911 hartree
dipole: 1.7268 4.0395 0.7522
dipole: 4.4570
quadrupole: -61.7826 -64.1465 -59.6566
quadrupole: -10.2104 -2.9931 -0.1030
quadrupole: 0.0793 -2.2846 2.2053 -10.2104 -2.9931 -0.1030
hfenergy: -461.8918025 hartree
pointgroup: C01 [X(C8H12O2)]
dipole: 0.7079443 1.576054 0.2995584 debye
dipolederiv: -1.3178214 -0.7163891 0.0963244 -0.2009679 -0.7055345 -0.0987483 0.2775946 0.061416 -0.2307146 -0.7946141 -0.4070577 0.0051727 -0.5209199 -0.9449516 -0.0444313 -0.0021178 -0.048638 -0.3346836 -0.0006893 0.007176 0.0305732 -0.0960834 0.1123545 0.0606702 0.116736 0.0440216 0.1015845 -0.1848808 0.0272355 0.0069967 0.0907172 0.0581713 0.0014594 0.0067443 0.0236089 0.1409324 0.071666 0.0300898 -0.0102243 0.092906 0.1298705 0.0403635 -0.0725532 0.0560285 0.1348703 0.6915709 0.1364725 -0.116576 0.3532113 0.7597399 0.1526778 -0.1655271 0.1989902 0.0613651 -0.210042 0.1531042 -0.028267 0.0529739 -0.1815194 0.0209735 -0.0211756 -0.0081697 -0.3045893 -0.0547202 0.1173574 0.0981306 0.1081693 -0.3246306 -0.1716187 0.1283261 -0.183116 0.1217223 -0.0643433 0.0604881 -0.0327576 0.0284463 0.0513747 0.0371412 0.0028965 0.0276645 0.0587548 1.5854977 0.7822058 -0.1466283 0.4070663 1.1290249 0.16052 -0.3007564 0.0138948 0.3050701 0.0412467 0.0152878 0.011067 0.0170675 0.0533106 -0.0529234 0.0050378 -0.0289615 -0.1674435 0.0598453 -0.0456684 -0.0047117 -0.0593278 -0.1190143 0.0072749 -0.0013773 -0.0146156 0.0704841 0.0294424 0.0146329 0.0413549 0.0046416 0.0873304 -0.0571458 0.0301198 -0.0253869 -0.1159693 0.019143 -0.0402857 0.0049301 -0.0494978 -0.1322298 0.0051308 -0.0174479 -0.0400253 0.0850013 0.0321173 0.0096914 -0.0231551 0.0124811 0.0614517 -0.0490659 0.017662 -0.0302826 -0.2003429 0.0124085 -0.0294003 -0.0018907 -0.0754517 -0.1997252 0.0156019 -0.0046229 -0.0118426 0.0698675 0.0903574 -0.0691469 0.0144747 -0.075871 -0.0274137 -0.0402822 0.0102123 -0.0398134 0.1760018 0.0707893 -0.0181219 0.0465216 -0.0688672 0.1163712 0.0300339 0.0816781 0.0022656 -0.0293842 -0.0260271 0.03111 -0.0564486 -0.0041308 0.0955497 0.031923 -0.1057114 0.0415996 0.0875144 -0.2224233 0.0145811 0.0573944 -0.0021449 0.0840145 0.0208909 0.0753534 0.0170612 0.064778 0.0762008 -0.0909006 -0.0172288 -0.028531 -0.1631134 0.0014971 -0.0268491 -0.0198917 0.0789553 0.095276 0.017538 0.0249477 0.0141131 0.0595684 -0.0719427 -0.0342222 -0.0358077 -0.1737743 unknown
polarizability: 116.4746026|-0.225442|88.4913237|-6.5317739|3.7727073|66.6268937 unknown
InChI: InChI=1S/C8H12O2/c1-2-3-4-7-5-6-8(9)10-7/h5H,2-4,6H2,1H3
charge 0 multiplicity 1
22 atoms
O  -0.972473 -0.645525 -0.417062
O  -3.060452 -1.638507 -0.053631
C  1.969645 -0.076551 0.202992
C  1.004594 0.833699 -0.60653
C  3.432986 0.06126 -0.271989
C  -0.431371 0.681023 -0.215207
C  -1.359167 1.528546 0.302734
C  -2.664181 0.790966 0.496039
C  4.404385 -0.829838 0.531164
C  -2.348744 -0.629311 0.006135
H  1.900313 0.180082 1.278917
H  1.640916 -1.128417 0.103586
H  1.114214 0.592781 -1.68356
H  1.290193 1.894732 -0.479243
H  3.492527 -0.201858 -1.347919
H  3.748819 1.121771 -0.192224
H  -1.189206 2.577436 0.541237
H  -3.005158 0.747277 1.54776
H  -3.505514 1.201982 -0.093324
H  5.443539 -0.721408 0.170571
H  4.125698 -1.896665 0.444578
H  4.389936 -0.565972 1.605377
