program: Gaussian 09
title: 000036727
version: EM64L-G09RevD.01
frameworkgroup: C1[X(C18H19ClN4O)]
method: RPBEPBE
basis: SDD
operation: Freq
keyword: #p
keyword: freq=noraman
keyword: PBEPBE/SDD
title: #p freq=noraman PBEPBE/SDD
converged: NO YES NO NO
title: Mulliken charges:
elementType: Cl O N N N N C C C C C C C C C C C C C C C C C C H H H H H H H H H H H H H H H H H H H
charge: -0.068466 -0.411218 -0.144686 -0.061779 -0.256017 -0.063013 -0.413671 -0.357205 -0.369977 -0.385041 0.313282 0.158147 -0.612843 0.304598 -0.046531 -0.337342 0.000840 -0.330741 -0.333836 -0.283942 -0.326185 -0.224528 -0.115192 -0.217510 0.266313 0.244716 0.246456 0.244431 0.186251 0.222018 0.222992 0.190290 0.227804 0.192049 0.225963 0.248399 0.262173 0.269959 0.229623 0.265306 0.352924 0.228824 0.256366
chargesum: 0.00000
title: Mulliken charges with hydrogens summed into heavy atoms:
elementType: Cl O N N N N C C C C C C C C C C C C C C C C C C
charge: -0.068466 -0.058294 -0.144686 -0.061779 -0.256017 -0.063013 0.097358 0.133682 0.038292 0.028241 0.313282 0.158147 0.032973 0.304598 -0.046531 -0.088943 0.000840 -0.068568 -0.063876 -0.054319 -0.060879 0.004296 -0.115192 0.038856
polarizability: 3.80137952e+02 -2.53139374e+01 3.12118954e+02 8.54000961e+00 -5.26809382e+00 1.47423795e+02
1716.lowfreq: -8.4574 -6.2339 -0.0006 0.0005 0.0014 4.3904 29.3523 39.4373 51.4229
frequency: 29.2214 39.4215 51.4194 73.8940 85.0728 100.4302 128.5577 137.4705 158.8425 173.3841 207.0295 223.5165 232.6188 247.7328 263.1191 279.6095 284.7866 291.7778 314.5698 326.2031 335.0608 340.9600 368.0726 376.3607 418.1584 444.1409 448.3058 457.4394 473.1831 493.2190 512.0570 538.6092 558.4972 583.6961 606.9502 616.3165 639.6754 651.9601 682.5142 700.5177 721.9654 744.3238 746.9017 761.3735 777.9552 827.1153 835.9562 848.3353 854.5386 859.6254 877.0750 914.9225 940.8738 958.4329 960.1754 981.9146 1002.3858 1011.1926 1022.5153 1046.5010 1060.4157 1067.2832 1074.8285 1091.9093 1108.2215 1123.4953 1131.7072 1147.2450 1149.5157 1157.1504 1190.1425 1194.1083 1201.9101 1216.2118 1224.3338 1234.8615 1246.4939 1269.8295 1282.5950 1288.5259 1323.3479 1333.9032 1347.2688 1357.3971 1359.7418 1370.9507 1380.7005 1386.6152 1427.0848 1432.5051 1438.4621 1448.4354 1451.5246 1455.0878 1456.0380 1463.8379 1475.2638 1482.0490 1489.2445 1513.1383 1524.2582 1537.9497 1581.6827 1609.3311 2840.2098 2851.6842 2872.2132 2973.1138 3010.1563 3024.6827 3034.4702 3038.1779 3082.2116 3104.4928 3109.0739 3115.8852 3131.5516 3155.5556 3156.4642 3169.0994 3170.7306 3177.5330 3398.4801
redmass: 5.1010 6.7255 4.2082 3.8317 4.0162 5.4293 5.9884 4.9051 3.8333 3.5906 4.8787 3.9349 1.3395 3.3294 3.3781 2.2204 3.4524 3.0735 2.3153 2.7901 4.2981 4.2981 2.9001 4.6639 2.7731 5.1568 3.9209 4.1044 2.6971 4.3513 4.5433 4.0431 4.2571 5.0347 5.0753 3.9030 4.4695 6.5228 5.8644 5.2506 4.6556 4.0662 4.0197 1.4152 3.9213 1.5172 1.6289 4.2356 1.7361 4.1732 1.4465 4.1270 2.4482 1.3391 1.3325 1.3197 2.4426 2.4294 2.4482 1.6804 1.9036 1.7141 1.9021 2.9749 1.8660 1.6089 1.7198 2.6900 3.3097 1.1185 1.7540 1.1223 1.9909 1.2309 1.9780 1.6841 1.7182 2.4287 1.5714 1.5528 2.1600 1.2923 1.4682 3.7530 1.6506 1.4845 3.4777 2.3331 4.3046 1.1828 2.9148 2.6698 1.1626 1.3219 1.0826 1.0676 1.1043 1.0532 2.7955 7.6530 7.3349 8.6173 6.8992 5.9584 1.0706 1.0680 1.0579 1.0687 1.0657 1.0740 1.0872 1.0895 1.1011 1.0979 1.0935 1.0871 1.0881 1.0945 1.0880 1.0992 1.0930 1.0974 1.0683
irintensity: 0.2495 0.2803 0.4024 0.0619 0.7694 8.8102 2.8092 4.5243 7.4887 1.9524 2.2718 0.5755 0.1324 2.2248 21.8598 27.5107 16.1124 27.3663 5.0109 3.9244 12.7860 6.1143 4.7188 2.7550 4.2658 17.2362 4.9811 22.1018 2.1312 5.8601 31.7391 6.0049 10.5195 2.5797 22.5051 12.6895 11.1702 9.9077 16.8715 16.9809 7.9936 8.8882 1.7176 95.2683 36.6411 45.2544 1.7206 26.1222 9.4639 28.6253 12.7076 7.6001 4.3902 6.4967 1.1370 1.7747 76.8393 18.4425 6.4412 11.5399 9.1984 23.4374 2.4668 23.3176 11.8789 2.7829 8.8303 26.2991 29.7716 12.8044 13.8953 2.2600 11.3112 22.0208 0.4568 31.7431 39.6550 148.1420 23.7816 60.3146 5.2406 2.5098 4.6018 22.3930 42.5851 16.2762 30.8982 9.0290 211.3935 0.9281 22.1603 28.3746 72.4050 272.3258 4.8755 8.6551 18.7698 9.8352 397.2632 247.9184 40.4405 17.6890 5.6468 47.8746 51.8376 56.4105 190.7860 44.5927 17.7823 49.8732 39.6923 60.0606 27.1657 9.9551 3.2296 3.6182 14.0235 20.6053 0.9491 29.1622 0.6657 7.8121 3.4060
temp: 298.150 k
press: 1.00000 atm
elementType: 17 8 7 7 7 7 6 6 6 6 6 6 6 6 6 6 6 6 6 6 6 6 6 6 1 1 1 1 1 1 1 1 1 1 1 1 1 1 1 1 1 1 1
symmnumber: 1
zpe: 885899.5 jmol-1
zpe.correction: 0.337421 hartree
zpe.thermalcorrener: 0.358660 hartree
zpe.thermalcorrenthalpy: 0.359604 hartree
zpe.thermalcorrgfe: 0.287638 hartree
zpe.sumelectzpe: -1449.765954 hartree
zpe.sumelectthermal: -1449.744715 hartree
zpe.sumelectthermalent: -1449.743771 hartree
zpe.sumelectthermalfe: -1449.815737 hartree
dipole: -5.9955 -0.2669 -0.0979
dipole: 6.0023
quadrupole: -138.9254 -146.6023 -148.7302
quadrupole: 6.4448 6.8904 1.9057
quadrupole: 5.8272 -1.8497 -3.9776 6.4448 6.8904 1.9057
hfenergy: -1450.1033753 hartree
pointgroup: C01 [X(C18H19Cl1N4O1)]
dipole: -2.3581054 -0.0007214 0.1261129 debye
polarizability: 377.3612634|-27.5854985|312.3640735|-11.8876837|20.9265045|149.955364 unknown
InChI: InChI=1S/C18H19ClN4O/c1-21-8-10-22(11-9-21)18-14-4-2-3-5-15(14)20-16-7-6-13(19)12-17(16)23(18)24/h2-7,12,24H,8-11H2,1H3
charge 0 multiplicity 1
43 atoms
Cl 4.93774 -2.783401 -1.764751
O  0.544843 -1.694111 1.585488
N  -1.756703 -0.699702 0.26402
N  -4.33734 -1.945953 -0.042409
N  0.574747 -0.840842 0.30997
N  1.943557 1.853233 0.720356
C  -2.968914 -0.104835 0.883096
C  -1.864722 -2.173941 0.130214
C  -4.226081 -0.474927 0.077467
C  -3.129263 -2.520186 -0.678775
C  -0.543698 -0.041355 0.154104
C  -0.446527 1.364981 -0.109477
C  -5.588196 -2.371867 -0.699026
C  1.910343 -0.538055 -0.117452
C  0.658991 2.188475 0.431643
C  -1.543042 2.032747 -0.776035
C  2.558549 0.683909 0.277992
C  0.357951 3.601734 0.601028
C  2.626426 -1.581439 -0.75341
C  -1.700002 3.411919 -0.725083
C  3.980891 0.745186 0.10999
C  -0.763891 4.195837 0.03888
C  4.005566 -1.437971 -0.952086
C  4.702789 -0.291835 -0.499958
H  -2.857468 0.985889 0.958268
H  -3.069214 -0.528011 1.903874
H  -1.915636 -2.636962 1.133197
H  -0.959683 -2.5505 -0.370531
H  -4.184351 0.025831 -0.9252
H  -5.117801 -0.092349 0.607644
H  -3.236069 -3.620364 -0.711506
H  -3.001323 -2.157885 -1.731496
H  -5.655181 -3.474168 -0.688925
H  -5.67186 -2.029033 -1.760878
H  -6.454108 -1.972889 -0.141235
H  -2.258169 1.415406 -1.333587
H  1.127889 4.192364 1.10724
H  2.100252 -2.498787 -1.030835
H  -2.527238 3.8991 -1.25143
H  4.481887 1.656477 0.449556
H  0.908833 -1.084341 2.294211
H  -0.912694 5.277577 0.134184
H  5.78572 -0.216554 -0.634034
