program: Gaussian 09
title: 000036653
version: EM64L-G09RevD.01
frameworkgroup: C1[X(C10H16O2)]
method: RPBEPBE
basis: SDD
operation: Freq
keyword: #pfreq=noraman
keyword: PBEPBE/SDD
title: #p freq=noraman PBEPBE/SDD
converged: YES YES NO NO
title: Mulliken charges:
elementType: O O C C C C C C C C C C H H H H H H H H H H H H H H H H
charge: -0.457041 -0.206405 -0.056271 -0.181438 -0.147974 -0.469684 -0.448875 -0.389049 -0.419235 -0.480653 0.140672 -0.494902 0.233066 0.265029 0.209567 0.209835 0.197031 0.197956 0.221793 0.200166 0.190124 0.197191 0.238451 0.213147 0.228500 0.230854 0.241005 0.337140
chargesum: 0.00000
title: Mulliken charges with hydrogens summed into heavy atoms:
elementType: O O C C C C C C C C C C
charge: -0.119901 -0.206405 0.176795 0.083591 0.061594 -0.062818 -0.029126 0.001240 0.016407 -0.039006 0.140672 -0.023042
polarizability: 1.19097348e+02 2.44352435e+00 1.03420049e+02 1.10500821e+00 5.70681636e-02 9.23880083e+01
1716.lowfreq: -14.3769 -9.1825 0.0009 0.0010 0.0012 18.3123 76.1227 101.9958 149.4001
frequency: 76.0482 101.9206 149.3929 175.9153 207.1443 257.9948 295.0963 308.4766 333.1946 358.7270 401.5652 434.8590 451.7354 488.9713 514.7052 581.4189 623.5243 696.2853 766.0410 778.7660 823.3572 826.7073 848.8749 875.9105 903.4633 927.6282 941.4856 976.2872 997.5019 1020.2629 1052.4384 1062.1518 1086.3910 1104.4934 1108.2426 1119.4092 1137.6152 1151.5586 1167.6937 1215.3367 1222.8535 1230.2247 1256.5388 1274.7908 1279.8505 1294.1102 1304.3467 1323.9626 1335.3958 1341.8547 1343.5263 1349.3427 1351.9188 1368.6713 1381.2341 1437.2752 1454.8644 1463.0243 1469.6613 1471.3195 1476.8606 1622.0170 2944.6438 2958.2310 2961.6081 2965.0460 2979.0942 2981.4084 2985.3458 2989.5243 2991.2598 3021.1670 3031.6058 3036.0387 3046.8264 3057.7324 3076.3319 3562.6944
redmass: 5.8949 3.0844 3.2233 4.1017 2.9795 2.3578 1.1502 2.6168 1.8807 3.1374 2.8243 2.9927 3.1166 2.5271 2.7649 4.6609 3.6068 2.3102 2.5147 2.1452 2.0960 2.4678 2.1841 2.1245 2.2146 2.0140 2.3916 2.1643 2.0877 1.8764 1.5576 1.7039 1.5755 1.4355 1.4776 2.7144 1.2947 1.8439 1.4167 1.4459 1.2887 1.4203 1.3674 1.3732 1.2678 1.4158 1.4049 1.5440 1.3750 1.4099 1.5131 1.4675 1.5157 1.6675 1.5915 1.0879 1.0894 1.0901 1.0853 1.0865 1.0914 9.4347 1.0822 1.0764 1.0608 1.0644 1.0656 1.0651 1.0706 1.0764 1.0640 1.0980 1.0999 1.0994 1.0976 1.1020 1.0981 1.0662
irintensity: 4.3760 0.8739 0.5842 4.8373 5.2749 1.6930 126.0092 24.8874 1.3418 1.0958 1.7273 4.7952 7.5935 0.4981 0.5131 10.9047 4.3876 0.7301 1.1829 2.5410 16.2036 1.1017 2.8355 17.8669 13.0026 24.2894 23.1534 9.0566 8.6500 11.7870 0.8948 4.8945 13.7332 9.4192 9.5161 32.2614 11.5335 7.7780 14.8346 8.1060 6.4714 16.1288 6.0650 2.0675 8.1609 1.8441 16.5665 14.6407 0.3245 2.9080 1.9048 0.0685 0.8182 4.9660 8.4700 15.5592 11.3803 7.2287 9.0716 20.8389 11.8134 134.6125 38.9362 13.7103 35.3072 31.6682 9.7470 56.7054 50.3767 22.2586 30.8480 79.0894 35.9503 47.6300 34.2175 50.7196 19.4399 2.3320
temp: 298.150 k
press: 1.00000 atm
elementType: 8 8 6 6 6 6 6 6 6 6 6 6 1 1 1 1 1 1 1 1 1 1 1 1 1 1 1 1
symmnumber: 1
zpe: 639947.1 jmol-1
zpe.correction: 0.243743 hartree
zpe.thermalcorrener: 0.254786 hartree
zpe.thermalcorrenthalpy: 0.255730 hartree
zpe.thermalcorrgfe: 0.207693 hartree
zpe.sumelectzpe: -540.162633 hartree
zpe.sumelectthermal: -540.151590 hartree
zpe.sumelectthermalent: -540.150646 hartree
zpe.sumelectthermalfe: -540.198683 hartree
dipole: -2.4493 -2.8239 -0.6713
dipole: 3.7979
quadrupole: -64.0086 -81.0779 -73.9813
quadrupole: -2.3338 2.8086 3.6969
quadrupole: 9.0140 -8.0553 -0.9587 -2.3338 2.8086 3.6969
hfenergy: -540.406376 hartree
pointgroup: C01 [X(C10H16O2)]
dipole: 0.9454574 -1.1308385 0.2448876 debye
polarizability: 119.0175317|-2.7261835|103.5089442|0.9486743|0.0836788|92.3789285 unknown
InChI: InChI=1S/C10H16O2/c11-9-5-6-10(12)8-4-2-1-3-7(8)9/h7-9,11H,1-6H2
charge 0 multiplicity 1
28 atoms
O  2.282141 -1.145909 -1.233186
O  -0.419002 2.448013 0.414109
C  0.085182 -1.061704 -0.24578
C  -0.253759 0.342359 -0.852584
C  1.587435 -1.185328 0.07657
C  -0.811717 -1.373845 0.978487
C  -1.759863 0.471098 -1.174305
C  -2.310791 -1.283803 0.60602
C  -2.65847 0.11056 0.033042
C  2.095391 -0.057876 1.000337
C  0.282163 1.466804 0.043515
C  1.757297 1.344834 0.430147
H  -0.134853 -1.814251 -1.030514
H  0.338097 0.416569 -1.790912
H  1.773157 -2.169457 0.560879
H  -0.605993 -0.657575 1.800435
H  -0.57337 -2.385103 1.365144
H  -1.994967 -0.204161 -2.022173
H  -1.977272 1.50395 -1.502395
H  -2.934819 -1.498443 1.49498
H  -2.545173 -2.064487 -0.147681
H  -3.721833 0.13955 -0.27354
H  -2.528558 0.878888 0.818477
H  3.190789 -0.150445 1.142378
H  1.639324 -0.177713 2.001975
H  2.354769 1.50201 -0.490945
H  2.009249 2.146152 1.145531
H  3.252945 -1.276289 -1.086114
