program: Gaussian 09
title: 000036678
version: EM64L-G09RevD.01
frameworkgroup: C1[X(C14H10Cl2O2)]
method: RPBEPBE
basis: SDD
operation: Freq
keyword: #p
keyword: freq=noraman
keyword: PBEPBE/SDD
title: #p freq=noraman PBEPBE/SDD
converged: YES YES NO NO
title: Mulliken charges:
elementType: Cl Cl O O C C C C C C C C C C C C C C H H H H H H H H H H
charge: -0.071454 -0.057254 -0.398049 -0.243667 -0.494291 0.501948 0.608118 -0.409222 -0.366419 -0.358477 -0.336710 0.170538 -0.209397 -0.216703 -0.225613 -0.243202 -0.111323 -0.230261 0.282565 0.248941 0.274118 0.262058 0.256338 0.255127 0.257951 0.234714 0.237873 0.381751
chargesum: 0.00000
title: Mulliken charges with hydrogens summed into heavy atoms:
elementType: Cl Cl O O C C C C C C C C C C C C C C
charge: -0.071454 -0.057254 -0.016298 -0.243667 -0.211725 0.501948 0.608118 -0.160281 -0.092301 -0.358477 -0.074652 0.170538 0.046941 0.038425 0.032338 -0.008488 -0.111323 0.007612
polarizability: 2.01717820e+02 4.19192485e+00 1.42262501e+02 2.66079697e-02 1.57321105e+01 1.64462423e+02
1716.lowfreq: -8.4572 -6.2161 -3.0076 0.0018 0.0020 0.0023 12.4262 32.4430 38.7954
frequency: 11.2385 32.4293 38.7924 45.8342 93.4077 114.9127 142.9159 148.7184 173.1507 234.8434 252.7459 285.6630 330.0484 341.0192 351.8134 404.5226 409.1060 418.0846 447.6569 497.0656 518.5115 555.3961 597.8702 622.4975 634.9806 664.1371 694.8187 705.8326 728.1681 736.8172 761.5745 806.9585 833.8845 842.1253 859.0974 870.6127 924.6567 952.1487 961.0322 979.6413 989.9754 999.8904 1010.6247 1041.4915 1057.0944 1075.5403 1112.6204 1126.6492 1173.6445 1180.2205 1191.7021 1194.6742 1238.5226 1244.6541 1292.7840 1306.7908 1346.5482 1379.3407 1384.3282 1406.8655 1426.3267 1460.4243 1476.8678 1574.7995 1586.2804 1595.5069 1603.0625 1652.4936 3078.5991 3139.3814 3141.7915 3151.1667 3154.0454 3165.9240 3170.6670 3174.0138 3177.4571 3501.0319
redmass: 6.2498 8.3322 7.4034 5.2550 7.4114 9.5153 6.4537 6.3304 11.5492 7.9173 6.5846 7.8938 6.4119 5.3856 6.7722 9.0564 2.9486 7.9507 3.3251 3.3378 3.9574 3.2538 3.6046 5.3529 2.9144 2.7175 5.9919 4.0630 4.8643 4.1625 1.2898 2.5215 1.4068 1.9061 2.8876 1.6389 4.2055 1.3736 1.4764 1.3565 1.3444 4.4977 6.3681 2.2159 2.4601 2.6736 1.4633 1.6530 1.1407 2.4112 1.6256 1.3963 1.5484 1.5693 1.4082 1.3591 2.6574 5.0075 4.0052 2.1184 2.1188 2.3720 2.3090 5.9991 7.2899 6.1684 6.7262 7.8869 1.0835 1.0859 1.0897 1.0892 1.0900 1.0951 1.0958 1.0969 1.1001 1.0638
irintensity: 0.2472 1.7002 2.6108 0.1147 0.7900 1.0291 0.0814 0.9054 0.9480 1.7529 0.3918 0.8622 1.5877 0.5147 0.2528 6.7704 0.0145 17.5037 10.5747 12.4558 3.2617 44.9108 76.1764 15.8001 52.7293 50.0572 10.4018 22.7695 13.6334 9.9351 94.8949 48.1460 1.9547 17.3534 9.6127 0.5247 9.2726 1.2150 0.8976 0.5262 0.4244 50.8014 36.6411 5.7856 343.1048 25.5893 12.5851 0.6276 1.5390 0.3400 1.6833 0.0913 3.0748 3.1436 6.4730 5.0519 55.9342 0.1615 18.7646 13.3157 19.9907 52.4600 93.9288 6.2065 0.8917 4.5203 5.2275 144.6783 4.0981 2.2704 3.1510 2.9179 6.6698 4.3376 4.3280 1.9326 13.0051 31.1582
temp: 298.150 k
press: 1.00000 atm
elementType: 17 17 8 8 6 6 6 6 6 6 6 6 6 6 6 6 6 6 1 1 1 1 1 1 1 1 1 1
symmnumber: 1
zpe: 526407.9 jmol-1
zpe.correction: 0.200498 hartree
zpe.thermalcorrener: 0.216554 hartree
zpe.thermalcorrenthalpy: 0.217498 hartree
zpe.thermalcorrgfe: 0.153429 hartree
zpe.sumelectzpe: -1608.804212 hartree
zpe.sumelectthermal: -1608.788156 hartree
zpe.sumelectthermalent: -1608.787212 hartree
zpe.sumelectthermalfe: -1608.851281 hartree
dipole: -2.3476 0.3809 0.5860
dipole: 2.4494
quadrupole: -122.8551 -110.9315 -112.2071
quadrupole: 3.6813 -5.3438 -2.9873
quadrupole: -7.5239 4.3997 3.1242 3.6813 -5.3438 -2.9873
hfenergy: -1609.0047097 hartree
pointgroup: C01 [X(C14H10Cl2O2)]
dipole: -0.9239985 -0.1764625 -0.2091553 debye
polarizability: 201.255576|4.8112818|134.7964099|-3.9439976|4.293693|172.3907581 unknown
InChI: InChI=1S/C14H10Cl2O2/c15-10-7-5-9(6-8-10)13(14(17)18)11-3-1-2-4-12(11)16/h1-8,13,17H
charge 0 multiplicity 1
28 atoms
Cl -2.043069 0.479557 2.691427
Cl 5.219825 1.764729 -0.160273
O  -0.668501 -3.316788 0.687375
O  -0.299008 -2.553408 -1.467014
C  -0.301913 -0.950788 0.447917
C  1.092109 -0.318826 0.262314
C  -1.419784 -0.005953 -0.029723
C  1.654804 0.395808 1.350189
C  1.810127 -0.388046 -0.957898
C  -2.246664 0.698765 0.87817
C  -1.639752 0.229676 -1.413357
C  -0.412416 -2.30865 -0.244286
C  2.908133 1.035486 1.230469
C  3.067609 0.242154 -1.091225
C  -3.24892 1.595403 0.459004
C  -2.63808 1.120055 -1.858682
C  3.596471 0.947197 0.005964
C  -3.444975 1.806606 -0.923108
H  -0.450646 -1.137806 1.52243
H  1.109471 0.462618 2.298144
H  1.401049 -0.9485 -1.804356
H  -1.025153 -0.310916 -2.139966
H  3.33769 1.586745 2.071688
H  3.623391 0.183078 -2.031475
H  -3.86155 2.116161 1.200341
H  -2.785114 1.277831 -2.93211
H  -4.221671 2.501762 -1.258408
H  -0.737562 -4.19315 0.217448
