program: Gaussian 09
title: 000036656
version: EM64L-G09RevD.01
frameworkgroup: C1[X(C11H12O4)]
method: RPBEPBE
basis: SDD
operation: Freq
keyword: #pfreq=noraman
keyword: PBEPBE/SDD
title: #p freq=noraman PBEPBE/SDD
converged: YES YES NO NO
title: Mulliken charges:
elementType: O O O O C C C C C C C C C C C H H H H H H H H H H H H
charge: -0.282023 -0.262017 -0.245865 -0.236172 0.133058 0.232577 -0.333061 -0.371488 0.187957 -0.220815 -0.218457 -0.219189 0.141641 -0.673083 -0.503553 0.269935 0.265170 0.236869 0.238505 0.230862 0.229894 0.213206 0.232774 0.227287 0.244358 0.252814 0.228816
chargesum: 0.00000
title: Mulliken charges with hydrogens summed into heavy atoms:
elementType: O O O O C C C C C C C C C C C
charge: -0.282023 -0.262017 -0.245865 -0.236172 0.133058 0.232577 -0.063125 -0.106319 0.187957 0.016053 0.020048 0.241566 0.141641 0.000185 0.222434
polarizability: 1.61289590e+02 -6.99327381e+00 1.60369437e+02 -4.22545974e+00 -6.31305305e+00 7.65899691e+01
1716.lowfreq: -0.0007 -0.0007 0.0004 4.4959 6.6280 9.4643 25.7538 53.1722 61.9083
frequency: 25.5783 53.1517 61.8966 75.6337 87.3948 95.2910 117.8236 125.8857 180.7398 221.4432 242.2591 262.5352 273.8911 313.4023 328.6319 376.0159 385.4902 419.3474 522.3784 539.1252 641.7079 669.3175 677.8834 702.5765 760.2385 782.8472 786.6633 800.3123 803.0108 851.4220 899.1016 920.5568 975.3428 1003.4490 1018.0224 1035.0178 1042.1358 1082.5492 1112.8777 1113.9354 1123.0985 1136.1877 1152.3007 1177.0931 1232.0781 1248.1957 1249.5133 1280.5938 1358.2589 1381.4283 1401.6979 1417.3505 1430.7547 1452.0949 1463.5886 1465.4505 1474.0915 1477.0634 1486.6990 1579.6795 1602.5024 1619.0322 1627.6180 2996.3715 3004.3422 3010.3260 3068.6373 3092.9158 3107.9398 3108.7041 3137.9075 3148.6379 3152.6704 3167.5883 3180.0691
redmass: 5.0872 3.4358 2.0128 2.3916 2.5437 2.0770 3.3951 3.9608 3.5129 5.1762 1.6714 3.2091 4.0662 5.0255 6.5135 4.3249 5.5527 3.6890 4.9242 4.6745 6.4073 6.1610 6.7710 4.1191 4.7437 4.6067 1.5727 1.1617 3.9177 4.6065 1.5631 5.3872 1.4028 1.3531 2.5313 3.2042 5.2732 3.2444 2.2064 1.3788 1.7298 1.4709 1.4727 1.0607 3.8526 2.6499 1.1410 1.6127 1.4016 10.6737 1.2672 1.2149 2.1514 1.0515 1.0403 1.0516 1.0744 2.4801 1.0837 7.2694 6.6832 10.4452 10.5096 1.0359 1.0291 1.0582 1.1065 1.0985 1.1025 1.1047 1.0862 1.1048 1.0912 1.0965 1.0978
irintensity: 0.3008 0.3618 1.2530 2.4058 0.8308 5.4656 4.1116 0.5105 0.4150 0.5782 1.8500 5.9828 12.5052 5.6973 9.0148 3.9800 5.1306 1.3539 2.5113 4.3170 3.8522 8.6458 1.1098 66.2222 25.9943 7.3885 34.8034 5.5004 1.9690 3.0861 2.7744 4.7883 2.8875 1.4331 8.6835 59.9656 215.1992 196.0653 3.3196 9.9925 39.3208 4.9510 26.5664 0.6283 192.8885 270.2839 5.9820 38.7153 1.6858 7.7734 22.0646 26.3734 11.9952 14.0051 12.4557 10.8783 7.4455 13.2612 11.4967 22.2802 44.2048 173.3117 148.2899 21.6105 32.8320 18.6107 7.3880 29.3587 44.2914 18.0665 1.8979 15.4089 8.9646 12.9174 11.2779
temp: 298.150 k
press: 1.00000 atm
elementType: 8 8 8 8 6 6 6 6 6 6 6 6 6 6 6 1 1 1 1 1 1 1 1 1 1 1 1
symmnumber: 1
zpe: 546689.6 jmol-1
zpe.correction: 0.208223 hartree
zpe.thermalcorrener: 0.223484 hartree
zpe.thermalcorrenthalpy: 0.224428 hartree
zpe.thermalcorrgfe: 0.164073 hartree
zpe.sumelectzpe: -726.160437 hartree
zpe.sumelectthermal: -726.145176 hartree
zpe.sumelectthermalent: -726.144231 hartree
zpe.sumelectthermalfe: -726.204587 hartree
dipole: 2.5339 1.5489 -2.0006
dipole: 3.5808
quadrupole: -77.0026 -72.2278 -93.1140
quadrupole: -5.4096 5.6796 5.1295
quadrupole: 3.7789 8.5537 -12.3325 -5.4096 5.6796 5.1295
hfenergy: -726.36866 hartree
pointgroup: C01 [X(C11H12O4)]
dipole: 1.0013783 0.5807721 -0.8028838 debye
polarizability: 159.9103714|-6.8780963|161.5933255|-8.2197048|-2.0769519|76.7452995 unknown
InChI: InChI=1S/C11H12O4/c1-3-15-11(13)9-7-5-4-6-8(9)10(12)14-2/h4-7H,3H2,1-2H3
charge 0 multiplicity 1
27 atoms
O  2.302169 0.040006 -0.258265
O  -1.308668 -1.760352 -0.905023
O  0.873124 -1.404059 0.881367
O  -2.818225 -1.376138 0.832232
C  0.030853 0.736889 0.035477
C  -1.359732 0.426025 0.057242
C  0.437892 2.091074 -0.071164
C  -2.310809 1.473177 0.027942
C  1.05864 -0.328314 0.262361
C  -0.517633 3.126955 -0.130598
C  -1.895767 2.818813 -0.066731
C  3.414235 -0.932493 -0.028143
C  -1.895137 -0.976808 0.084677
C  4.665676 -0.325293 -0.653122
C  -1.670273 -3.196511 -0.880298
H  1.507579 2.31612 -0.088865
H  -3.374558 1.21888 0.07224
H  -0.188717 4.168461 -0.210081
H  -2.642477 3.619391 -0.094051
H  3.515369 -1.093713 1.060603
H  3.131289 -1.894501 -0.492243
H  5.521345 -1.011487 -0.516751
H  4.524108 -0.157045 -1.734278
H  4.916295 0.639269 -0.179317
H  -2.765664 -3.319081 -0.844977
H  -1.215108 -3.667356 0.00726
H  -1.249707 -3.610309 -1.807295
