program: Gaussian 09
title: 000036796
version: EM64L-G09RevD.01
frameworkgroup: C1[X(C21H25N3O2)]
method: RPBEPBE
basis: SDD
operation: Freq
keyword: #p
keyword: freq=noraman
keyword: PBEPBE/SDD
title: #p freq=noraman PBEPBE/SDD
converged: YES YES NO NO
title: Mulliken charges:
elementType: O O N N N C C C C C C C C C C C C C C C C C C C C C H H H H H H H H H H H H H H H H H H H H H H H H H
charge: -0.207376 -0.236604 -0.183094 -0.453928 -0.102121 -0.046332 0.107292 -0.369158 0.411398 0.441836 0.171327 -0.367503 -0.412668 -0.383666 -0.336010 -0.382861 -0.330441 -0.330203 -0.225981 -0.237270 -0.236647 -0.238147 -0.672708 -0.672190 -0.243095 -0.242254 0.334574 0.237818 0.256207 0.216444 0.228360 0.258221 0.246214 0.262583 0.256521 0.191655 0.221514 0.188602 0.205154 0.228291 0.229768 0.228710 0.230147 0.206573 0.226742 0.208401 0.220671 0.204591 0.227073 0.230553 0.233017
chargesum: 0.00000
title: Mulliken charges with hydrogens summed into heavy atoms:
elementType: O O N N N C C C C C C C C C C C C C C C C C C C C C
charge: -0.207376 -0.236604 -0.183094 -0.119353 -0.102121 -0.046332 0.107292 0.124867 0.411398 0.441836 0.171327 0.077301 -0.154447 -0.137453 -0.073427 -0.126340 0.082728 0.063553 0.002311 -0.007502 -0.007938 -0.008000 -0.030993 -0.019854 -0.012542 -0.009237
polarizability: 2.85259413e+02 8.35283463e+00 2.51740498e+02 -1.40734838e+01 1.41339199e+01 2.08788717e+02
1716.lowfreq: -10.1213 -3.0579 -0.8057 -0.0006 -0.0003 0.0002 1.6044 17.2469 20.9425
frequency: -7.3040 16.7454 20.5403 22.2827 40.2247 49.1936 55.4616 66.3685 69.8736 90.6708 94.3998 112.6893 143.0212 153.8641 205.7472 214.0888 224.4174 239.1498 249.8227 265.6444 282.1756 298.4890 301.9906 311.0793 320.5402 350.8549 395.2060 400.2939 404.6211 413.1094 449.6869 481.4378 488.0266 494.5329 528.3364 593.8543 598.8077 615.2471 616.5495 662.5778 671.9642 689.0031 701.3493 704.6922 705.9018 721.2305 755.6860 765.3626 769.3188 782.8537 795.8399 799.4857 852.3839 857.3367 864.9977 905.7253 913.3871 927.9307 931.0577 978.1849 979.4315 982.6975 989.9356 990.2575 991.8337 999.0036 999.2305 1025.4501 1029.8392 1037.7042 1055.3030 1067.5299 1075.4786 1078.7582 1085.1042 1089.0225 1093.4200 1109.6107 1134.8398 1171.9126 1175.1302 1180.1325 1191.9429 1196.9808 1201.6060 1208.9578 1210.2280 1234.0566 1273.6536 1285.5886 1294.5518 1315.7044 1316.4612 1323.4494 1326.1629 1346.5784 1360.1294 1363.1580 1371.5500 1377.5200 1382.4028 1384.4211 1388.7593 1390.8480 1434.2686 1437.4831 1443.7740 1462.7122 1464.2606 1471.4780 1479.2639 1479.6949 1483.3273 1486.2026 1486.8949 1491.3811 1590.2921 1593.7305 1608.7681 1611.2997 1645.5930 1709.3695 2854.7630 2863.7800 2895.9523 2981.7660 2982.7337 3023.6724 3033.5944 3034.9355 3047.8870 3073.2021 3075.6050 3091.2083 3091.9970 3105.2671 3124.4102 3126.7850 3131.8381 3136.0957 3143.3185 3148.0661 3153.4954 3156.6332 3167.2860 3168.2129 3601.8563
redmass: 3.6764 3.8607 4.7922 4.0025 4.1009 3.0852 4.0542 4.4228 3.5179 2.3678 4.3465 3.7684 5.5991 2.0164 1.4151 3.4210 2.1732 2.9322 2.2876 5.5626 2.0041 3.7353 4.2742 5.3083 3.7415 5.0790 3.1536 2.8110 2.8480 4.6130 2.8220 2.7048 1.6506 2.5179 2.7862 6.8958 9.6501 6.3993 6.3930 5.5353 4.1786 7.0387 2.1536 3.4024 1.7541 6.2860 2.8325 1.4280 1.9135 1.8318 1.1768 1.2268 1.2518 1.2515 4.2146 3.6903 2.0362 1.5264 1.6651 2.4303 1.4493 1.4323 3.0639 3.6218 5.2177 1.3437 1.3416 2.5151 2.2159 3.4937 2.5243 2.3146 2.5239 2.0417 2.0253 1.6672 2.0855 2.7171 1.7703 1.1345 1.0519 1.9500 1.3758 1.1464 3.4134 2.6509 2.7192 3.1946 1.2668 1.2678 1.2572 1.3366 1.3222 1.5456 1.3955 1.8603 1.6810 1.5983 1.4157 5.6717 5.9352 1.8759 1.2413 1.2532 2.2246 2.2347 1.1079 1.0519 1.0546 1.0553 2.2014 1.0550 2.1858 1.0717 1.0692 1.0767 6.0751 6.2958 6.0151 6.0079 11.5245 9.8692 1.0720 1.0713 1.0703 1.0360 1.0359 1.0883 1.0873 1.0599 1.0887 1.0989 1.0982 1.1003 1.1002 1.1063 1.0857 1.0847 1.0875 1.0879 1.0921 1.0922 1.0959 1.0961 1.1014 1.1012 1.0800
irintensity: 0.3353 0.1263 0.2817 0.1348 0.0329 0.1986 0.0712 0.3381 0.0614 0.1751 0.4799 0.8663 5.2435 0.1967 1.3801 0.4451 1.0493 0.4502 2.2967 2.1323 2.9941 3.0748 2.7235 0.5832 10.1064 1.1510 8.7364 0.1486 0.1570 7.9215 8.2698 20.2461 75.2227 55.8988 34.2068 20.8243 20.4307 1.3967 1.3047 15.3726 3.7302 7.0548 16.1211 48.0872 63.5099 23.2365 15.1254 1.1775 40.8498 38.9607 4.1616 5.5736 0.2385 1.1579 5.3166 8.5579 1.8389 1.2351 0.4294 9.9687 1.8400 3.4409 2.1347 3.3215 0.9582 0.1050 0.5781 4.9466 12.5276 4.2204 4.9518 5.6453 25.5149 42.2493 1.3062 18.2557 57.6217 32.2763 9.9201 0.9443 0.0771 4.1663 3.7408 0.9780 28.0728 22.6830 21.6137 33.2491 14.5001 29.7549 26.9210 5.9766 2.5249 53.1817 25.0380 63.6059 44.4070 76.0594 40.5129 0.0637 7.8446 95.1108 19.5248 19.8902 20.2639 6.9933 29.0941 4.5507 2.4462 1.1906 17.1220 3.7743 18.3580 14.6876 9.8929 11.3346 0.6250 0.3350 5.3529 3.2657 483.1463 278.2071 40.1690 145.8776 94.9115 36.9264 24.8493 12.4433 24.0724 12.4469 15.0648 32.5114 84.2091 36.6189 43.8705 4.2871 2.5319 0.3075 0.5096 4.9816 15.7308 19.5352 29.5502 25.1950 20.5894 17.2834 45.7355
temp: 298.150 k
press: 1.00000 atm
elementType: 8 8 7 7 7 6 6 6 6 6 6 6 6 6 6 6 6 6 6 6 6 6 6 6 6 6 1 1 1 1 1 1 1 1 1 1 1 1 1 1 1 1 1 1 1 1 1 1 1 1 1
symmnumber: 1
zpe: 1101257.1 jmol-1
zpe.correction: 0.419447 hartree
zpe.thermalcorrener: 0.443862 hartree
zpe.thermalcorrenthalpy: 0.444806 hartree
zpe.thermalcorrgfe: 0.362270 hartree
zpe.sumelectzpe: -1128.054641 hartree
zpe.sumelectthermal: -1128.030226 hartree
zpe.sumelectthermalent: -1128.029282 hartree
zpe.sumelectthermalfe: -1128.111818 hartree
dipole: -1.9528 1.6458 -0.2147
dipole: 2.5628
quadrupole: -134.2223 -142.2086 -164.7009
quadrupole: 5.0224 5.0749 -0.2161
quadrupole: 12.8217 4.8353 -17.6570 5.0224 5.0749 -0.2161
hfenergy: -1128.4740878 hartree
pointgroup: C01 [X(C21H25N3O2)]
dipole: -0.7367091 0.6626605 -0.1865419 debye
polarizability: 286.2193856|4.7882558|254.3236133|-13.4329883|8.3543407|205.2456299 unknown
InChI: InChI=1S/C21H25N3O2/c1-3-23(4-2)15-16-24-19(25)21(22-20(24)26,17-11-7-5-8-12-17)18-13-9-6-10-14-18/h5-14,22H,3-4,15-16H2,1-2H3
charge 0 multiplicity 1
51 atoms
O  0.152063 0.174925 1.671977
O  1.189955 -1.253297 -2.686624
N  0.974337 -0.675512 -0.37504
N  -0.833631 -0.473668 -1.701448
N  4.668595 -0.125518 0.299559
C  -1.317303 -0.014325 -0.378413
C  0.001414 -0.135089 0.46532
C  2.353884 -0.988023 0.028471
C  -2.357405 -0.975193 0.240386
C  -1.829019 1.438923 -0.475422
C  0.500619 -0.846444 -1.719958
C  3.272677 0.259939 0.000704
C  -2.656906 -2.222389 -0.356029
C  -0.989556 2.546827 -0.204506
C  -2.983381 -0.619481 1.462457
C  -3.149391 1.67276 -0.938827
C  5.425101 -0.543198 -0.912292
C  5.394124 0.850646 1.153474
C  -3.586907 -3.098175 0.25054
C  -1.460609 3.864566 -0.397441
C  -3.906287 -1.496774 2.068941
C  -3.617518 2.989062 -1.138846
C  6.557027 -1.541523 -0.602878
C  4.938703 0.810498 2.624758
C  -4.215511 -2.738102 1.463128
C  -2.773251 4.091044 -0.869337
H  -1.372262 -0.372348 -2.559802
H  2.731023 -1.754564 -0.669626
H  2.33722 -1.404852 1.049096
H  3.175727 0.76188 -0.991502
H  2.914896 0.972012 0.765133
H  -2.160197 -2.510856 -1.288277
H  0.024356 2.38867 0.177272
H  -2.735561 0.335738 1.936857
H  -3.816601 0.823388 -1.126894
H  5.83991 0.342984 -1.456239
H  4.710901 -1.023672 -1.607041
H  5.300332 1.892858 0.755036
H  6.468898 0.597034 1.110529
H  -3.814876 -4.05999 -0.222282
H  -0.804446 4.713468 -0.175823
H  -4.38172 -1.215026 3.014921
H  -4.639346 3.154871 -1.497574
H  7.319772 -1.108345 0.069744
H  6.145944 -2.441822 -0.114025
H  7.06789 -1.84517 -1.535711
H  3.864781 1.048853 2.731646
H  5.506533 1.545115 3.22609
H  5.10386 -0.196528 3.045464
H  -4.934464 -3.417455 1.934509
H  -3.13659 5.113775 -1.018753
