program: Gaussian 09
title: 000036711
version: EM64L-G09RevD.01
frameworkgroup: C1[X(C15H24N2O3)]
method: RPBEPBE
basis: SDD
operation: Freq
keyword: #p
keyword: freq=noraman
keyword: PBEPBE/SDD
title: #p freq=noraman PBEPBE/SDD
converged: YES YES NO NO
title: Mulliken charges:
elementType: O O O N N C C C C C C C C C C C C C C C H H H H H H H H H H H H H H H H H H H H H H H H
charge: -0.280026 -0.446883 -0.277300 -0.337560 -0.363765 -0.453412 -0.083880 -0.029273 -0.255539 -0.657263 -0.720303 0.380821 0.486116 -0.392574 -0.343485 -0.521763 -0.350542 -0.455023 0.263898 -0.773644 0.188117 0.257852 0.178846 0.188883 0.252559 0.229851 0.215221 0.198053 0.213859 0.232036 0.223136 0.219701 0.207395 0.332340 0.248154 0.249023 0.223194 0.265348 0.247326 0.227916 0.298245 0.252825 0.252768 0.208750
chargesum: 0.00000
title: Mulliken charges with hydrogens summed into heavy atoms:
elementType: O O O N N C C C C C C C C C C C C C C C
charge: -0.280026 -0.114542 -0.277300 -0.085001 -0.065520 -0.007443 0.094967 0.159610 0.189532 -0.013314 -0.070071 0.380821 0.486116 -0.144420 -0.094462 -0.033221 -0.103217 -0.227106 0.263898 -0.059300
polarizability: 2.56923202e+02 1.43360532e+01 1.60506915e+02 -6.63245240e+00 -6.58279534e+00 1.61700901e+02
1716.lowfreq: -10.7340 -4.1683 -2.9140 -0.0009 -0.0007 -0.0004 8.9796 13.0721 19.8718
frequency: 8.5598 11.9573 19.7650 26.3117 37.0333 47.6395 65.4870 70.0430 95.6654 103.9243 125.1069 147.4417 172.5331 192.9523 205.3087 220.9562 230.9525 240.6782 260.3950 283.9038 311.1366 321.0327 336.0591 373.3913 406.7656 416.3821 427.5718 441.0130 452.8327 492.5169 510.0563 536.2773 568.3880 599.4129 612.4807 622.2231 633.5786 643.1021 724.1611 767.3143 810.1266 813.6456 825.5301 837.6110 842.5094 871.6828 916.0566 917.9380 929.2477 935.3973 949.7011 961.6479 965.7639 974.8240 1000.2463 1014.3330 1035.6075 1040.4687 1071.1601 1081.9245 1086.9818 1100.5450 1118.3388 1138.4345 1156.5480 1178.0298 1181.7331 1213.4910 1215.9665 1224.8192 1227.1508 1232.5282 1252.0882 1260.6586 1291.2735 1305.4451 1321.5366 1337.4029 1344.0343 1361.2055 1374.7780 1380.4442 1385.2635 1389.1790 1391.6250 1403.0977 1420.2203 1445.2078 1449.7207 1451.3758 1460.6034 1465.3804 1466.5573 1474.4400 1476.5671 1484.1808 1484.5354 1488.1163 1503.6343 1583.8010 1617.6617 1624.8007 2841.4264 2865.2730 2919.9605 2972.8083 2980.0734 2980.8948 2981.5517 2994.9202 3041.3570 3047.2836 3064.6303 3078.8454 3083.2509 3085.9299 3089.1958 3096.1716 3099.2292 3116.3990 3132.3195 3162.1955 3165.2719 3443.8399 3552.5970 3553.6097
redmass: 4.6828 3.8302 3.9315 3.2969 3.8403 3.4536 2.5084 1.4385 4.0152 3.0509 4.2317 5.3012 4.7166 1.2686 2.0540 2.3911 1.2738 1.1805 3.6685 2.9234 2.7932 2.5441 4.4135 2.4335 3.1897 2.9710 2.5381 2.8263 3.1245 2.8259 3.0826 2.3660 2.4209 3.6603 1.5712 2.7464 3.2532 2.2823 3.5419 3.9276 2.2367 1.6029 3.0379 1.7742 2.7789 2.9946 1.7906 1.4915 1.9828 1.4421 1.6627 2.1081 1.3735 1.6932 2.6694 2.2549 2.3942 1.6421 2.2306 3.8485 2.3824 2.2109 1.3095 2.1666 1.7423 1.3994 1.6517 1.2804 1.8056 1.3394 1.3046 4.0287 1.9578 1.1225 1.1534 1.2959 1.3510 1.3878 1.6240 1.3609 1.2958 1.4181 1.4689 1.7849 1.2256 1.9554 3.1421 1.1257 1.0458 1.1372 1.1078 1.1405 1.0506 1.1402 1.0825 1.4636 1.2420 1.0665 2.3843 6.9405 6.3202 6.3423 1.0726 1.0823 1.0820 1.0363 1.0561 1.0617 1.0357 1.0360 1.0994 1.1077 1.0988 1.0996 1.0923 1.0940 1.0989 1.0995 1.0991 1.0896 1.0888 1.0944 1.0950 1.0744 1.0659 1.0779
irintensity: 3.2051 2.1068 1.4016 0.6777 1.2322 1.5932 8.4552 0.5418 1.7159 2.8934 0.4698 0.7186 6.8367 12.4826 26.4198 23.5251 84.0909 2.4122 17.2366 2.0413 8.7607 4.7861 2.4544 5.8653 1.5823 1.6619 13.1265 11.3104 14.4539 0.5658 21.1183 34.8577 69.2079 7.2159 53.6110 9.6821 24.0504 54.2695 0.9779 8.2214 11.3905 9.7198 13.3940 49.1467 16.8998 11.4411 18.5000 18.1530 25.6265 3.8002 22.3736 16.8678 0.0476 5.3603 1.2408 18.2478 1.3038 11.9126 92.2228 8.4757 14.3293 5.4570 15.8576 11.7156 50.3463 73.2064 64.0093 13.6899 28.3939 25.4642 6.6488 268.3613 97.7373 9.4256 20.6582 6.6964 2.5873 19.7948 10.9763 7.3135 12.0713 13.8386 87.3597 27.7497 18.0429 12.9479 7.2466 78.0363 15.0281 16.2634 4.9492 103.6062 0.1034 46.5725 7.8498 102.4889 49.8214 23.0674 127.0893 16.1222 209.7306 57.0229 126.9837 115.0354 62.7894 37.4782 36.8799 52.4185 14.6119 13.1026 12.3601 25.0126 37.0649 24.0538 14.0745 24.2520 61.2276 18.1021 14.1546 19.6967 11.4859 14.1718 6.1238 1.3317 3.8728 15.4984
temp: 298.150 k
press: 1.00000 atm
elementType: 8 8 8 7 7 6 6 6 6 6 6 6 6 6 6 6 6 6 6 6 1 1 1 1 1 1 1 1 1 1 1 1 1 1 1 1 1 1 1 1 1 1 1 1
symmnumber: 1
zpe: 973019.6 jmol-1
zpe.correction: 0.370604 hartree
zpe.thermalcorrener: 0.393455 hartree
zpe.thermalcorrenthalpy: 0.394399 hartree
zpe.thermalcorrgfe: 0.312954 hartree
zpe.sumelectzpe: -919.597713 hartree
zpe.sumelectthermal: -919.574862 hartree
zpe.sumelectthermalent: -919.573918 hartree
zpe.sumelectthermalfe: -919.655363 hartree
dipole: -5.6510 3.9092 2.5685
dipole: 7.3358
quadrupole: -121.4955 -122.0194 -115.7817
quadrupole: 13.3109 12.1235 -5.4261
quadrupole: -1.7299 -2.2539 3.9838 13.3109 12.1235 -5.4261
hfenergy: -919.9683167 hartree
pointgroup: C01 [X(C15H24N2O3)]
dipole: -1.9475456 1.6936569 1.2916037 debye
polarizability: 258.2486926|1.6801728|159.7535791|-11.2405779|-5.9354741|161.1287461 unknown
InChI: InChI=1S/C15H24N2O3/c1-11(2)16-9-14(19)10-20-15-6-4-13(5-7-15)8-17-12(3)18/h4-7,11,14,16-17,19H,8-10H2,1-3H3
charge 0 multiplicity 1
44 atoms
O  -1.603314 -0.739395 -0.418042
O  -4.15122 -2.003226 -1.07722
O  6.270699 -0.888131 -1.230013
N  -4.288897 1.393223 0.581591
N  4.790818 -0.006374 0.338042
C  -4.229391 0.438023 -0.540008
C  -3.988991 -0.997977 -0.01623
C  -3.910209 2.805094 0.290089
C  -2.593569 -1.188864 0.572323
C  -2.376266 2.937916 0.16536
C  -4.450564 3.703691 1.421169
C  -0.249447 -0.893999 -0.099445
C  2.556121 -1.122864 0.333222
C  0.663798 -0.517498 -1.119191
C  0.237374 -1.384029 1.137418
C  4.056265 -1.268398 0.550544
C  2.046635 -0.632921 -0.900816
C  1.63372 -1.49088 1.338275
C  5.854825 0.097926 -0.546478
C  6.495521 1.480818 -0.642865
H  -5.160217 0.436472 -1.164651
H  -3.393102 0.705137 -1.20595
H  -4.715056 -1.20024 0.805944
H  -4.368964 3.147095 -0.671399
H  -5.184785 1.341333 1.084184
H  -2.434431 -2.260169 0.803694
H  -2.510724 -0.575161 1.490559
H  -2.099118 3.96532 -0.135935
H  -1.899292 2.708159 1.135329
H  -1.964948 2.237732 -0.583021
H  -4.045832 3.371594 2.395276
H  -4.150574 4.754081 1.260917
H  -5.55624 3.670734 1.472993
H  -4.945514 -1.771389 -1.622692
H  0.263768 -0.154036 -2.070891
H  -0.44699 -1.678367 1.937996
H  4.252061 -1.65101 1.571729
H  4.503782 -1.985375 -0.163548
H  2.746097 -0.349467 -1.696107
H  2.004657 -1.872835 2.298013
H  4.477152 0.822181 0.845956
H  7.556022 1.407011 -0.345555
H  6.474893 1.813604 -1.694783
H  6.001448 2.243262 -0.015684
