program: Gaussian 09
title: 000036677
version: EM64L-G09RevD.01
frameworkgroup: C1[X(C14H13N3O3)]
method: RPBEPBE
basis: SDD
operation: Freq
keyword: #p
keyword: freq=noraman
keyword: PBEPBE/SDD
title: #p freq=noraman PBEPBE/SDD
converged: YES YES NO NO
title: Mulliken charges:
elementType: O O O N N N C C C C C C C C C C C C C C H H H H H H H H H H H H H
charge: -0.274267 -0.286896 -0.247248 -0.385606 0.000010 -0.004490 -0.395247 -0.225421 0.212399 0.240794 0.205403 0.213232 -0.254133 -0.447643 -0.267458 -0.178566 -0.414217 -0.188520 -0.325855 -0.317333 0.267293 0.222207 0.229363 0.232316 0.309770 0.279064 0.234048 0.315942 0.237975 0.279111 0.237898 0.250038 0.246039
chargesum: 0.00000
title: Mulliken charges with hydrogens summed into heavy atoms:
elementType: O O O N N N C C C C C C C C C C C C C C
charge: -0.274267 -0.286896 -0.247248 -0.075836 0.000010 -0.004490 0.094252 0.236258 0.212399 0.240794 0.205403 0.213232 0.024931 -0.213595 0.048483 0.059408 -0.135106 0.049378 -0.075817 -0.071294
polarizability: 1.82821947e+02 -2.61061980e+00 2.11894049e+02 6.50126764e+00 -1.72135272e+01 1.27122221e+02
1716.lowfreq: -7.0654 -0.0003 0.0002 0.0004 2.3030 4.8978 6.8845 20.8842 21.3774
frequency: 3.8786 20.7498 21.2950 45.9298 55.5001 70.9498 90.7139 125.2137 142.3206 173.3054 203.5944 238.5014 273.7053 310.3610 336.1060 349.1340 374.5763 376.0431 414.4477 434.6573 442.8594 476.5237 521.4257 556.4505 608.8568 609.2362 677.5140 688.0891 697.0457 704.9939 720.0447 724.4912 771.0489 818.6640 834.4918 835.4397 855.4698 891.6531 915.7021 947.6350 960.2701 971.3339 980.3798 997.6860 1003.5918 1007.0250 1019.7615 1020.6830 1026.8673 1057.7962 1076.7569 1095.3947 1106.8620 1125.8359 1155.8245 1197.3858 1202.4139 1211.6922 1237.8429 1267.3558 1282.3985 1311.9022 1312.5542 1331.1011 1334.5820 1356.3201 1371.5796 1406.7834 1413.0292 1438.1543 1452.5977 1453.7701 1466.2869 1504.1935 1545.0922 1550.8456 1582.1494 1583.5034 1601.3623 1626.9372 2998.1043 3012.2899 3065.3331 3091.2103 3104.0841 3134.3257 3138.4686 3149.1521 3152.6795 3156.0000 3171.6301 3174.8751 3553.6010
redmass: 7.6271 5.1498 6.5997 6.9530 6.1542 5.8427 6.2933 3.9552 4.6054 4.2909 3.6644 5.7708 5.3259 2.6576 5.0922 5.8716 2.9108 2.9869 4.8004 4.9980 4.3357 5.9101 2.2848 1.3549 7.6923 7.7445 5.7572 7.4134 7.2439 6.5612 1.7763 1.9016 3.8686 6.2695 1.7987 1.6940 4.6440 2.2275 1.4622 1.3768 1.4541 1.5094 3.4588 3.8817 1.4364 3.5007 1.3967 4.0127 3.3369 2.5306 3.8809 2.3461 1.6126 1.7064 2.2740 1.3066 1.2820 1.2868 3.0030 1.4165 1.8090 9.3401 10.5667 1.2493 1.3135 1.4070 1.3426 1.9703 2.1832 1.1019 1.8450 2.0919 1.1569 1.8941 5.5506 5.7524 5.6293 5.9303 7.2911 11.4317 1.0575 1.0636 1.1072 1.0998 1.0908 1.0885 1.0889 1.0926 1.0930 1.0916 1.1005 1.1001 1.0774
irintensity: 1.9875 0.9418 1.3774 9.5703 1.4176 4.9831 1.3309 2.8720 5.0423 4.5616 2.6318 6.9140 10.6929 12.3972 1.3431 2.9282 0.3572 1.7151 8.4792 2.8702 5.5960 2.1530 7.5332 127.5989 1.6396 5.0550 3.6012 0.5655 4.9412 4.1769 60.2831 68.3015 1.0573 11.4206 13.8540 27.3757 1.8646 2.4831 2.8698 1.0784 0.5571 3.0672 46.1360 18.3062 1.5267 25.1500 3.4184 0.5107 5.7286 1.8315 236.1891 12.0317 18.7251 20.1074 12.2710 1.5089 0.9822 9.8693 289.5538 34.4845 144.1639 8.6163 1.4319 2.1756 1.0010 11.3738 2.3710 18.1247 18.7207 27.2150 59.6110 12.0990 21.5214 174.1811 3.2472 20.1746 42.5196 32.3140 119.9287 229.3334 8.6955 65.1769 25.0755 7.2745 25.6246 12.9109 6.9146 3.5834 7.5127 8.0076 18.6212 17.0545 14.5600
temp: 298.150 k
press: 1.00000 atm
elementType: 8 8 8 7 7 7 6 6 6 6 6 6 6 6 6 6 6 6 6 6 1 1 1 1 1 1 1 1 1 1 1 1 1
symmnumber: 1
zpe: 657397.5 jmol-1
zpe.correction: 0.250389 hartree
zpe.thermalcorrener: 0.268107 hartree
zpe.thermalcorrenthalpy: 0.269051 hartree
zpe.thermalcorrgfe: 0.199110 hartree
zpe.sumelectzpe: -929.791013 hartree
zpe.sumelectthermal: -929.773296 hartree
zpe.sumelectthermalent: -929.772352 hartree
zpe.sumelectthermalfe: -929.842293 hartree
dipole: -2.9708 0.6889 1.3612
dipole: 3.3396
quadrupole: -139.7074 -91.6895 -125.2418
quadrupole: 1.9265 8.6480 -2.0850
quadrupole: -20.8278 27.1901 -6.3623 1.9265 8.6480 -2.0850
hfenergy: -930.0414028 hartree
pointgroup: C01 [X(C14H13N3O3)]
dipole: -1.1711146 -0.2552744 -0.5382268 debye
polarizability: 182.7197725|2.6480763|213.0950942|-6.6906077|-14.0056021|126.0233505 unknown
InChI: InChI=1S/C14H13N3O3/c18-13(11-3-1-5-15-9-11)17-7-8-20-14(19)12-4-2-6-16-10-12/h1-6,9-10,17H,7-8H2
charge 0 multiplicity 1
33 atoms
O  1.340704 -1.621857 -0.263434
O  -1.149704 -0.267668 -1.803373
O  2.867584 -2.045065 1.450891
N  -1.584574 -1.984636 -0.283465
N  -4.829136 0.354947 1.315703
N  4.513412 1.858876 0.780739
C  -0.60086 -2.913205 -0.854763
C  0.722466 -2.95212 -0.077842
C  -1.794322 -0.714149 -0.802747
C  -2.843709 0.120881 -0.111376
C  2.880329 0.103989 0.274089
C  2.403947 -1.275167 0.575091
C  -2.822689 1.52304 -0.321656
C  -3.880313 -0.409632 0.701423
C  2.250391 0.929942 -0.694105
C  -3.794701 2.328142 0.304049
C  4.001664 0.611569 0.982136
C  2.773233 2.222083 -0.910226
C  -4.769419 1.705702 1.120085
C  3.895981 2.641397 -0.157369
H  -0.404957 -2.58332 -1.888944
H  -1.027312 -3.933926 -0.883501
H  0.585639 -3.147979 1.001948
H  1.397445 -3.72541 -0.490592
H  -2.052559 -2.25002 0.584397
H  -2.050811 1.942006 -0.974973
H  -3.995736 -1.490856 0.853585
H  1.381263 0.558906 -1.247358
H  -3.804546 3.413704 0.167448
H  4.4986 -0.011753 1.733355
H  2.323489 2.894387 -1.647124
H  -5.536728 2.295766 1.633489
H  4.32753 3.638826 -0.300282
