program: Gaussian 09
title: 000036639
version: EM64L-G09RevD.01
frameworkgroup: C1[X(C10H13ClN2O2)]
method: RPBEPBE
basis: SDD
operation: Freq
keyword: #p
keyword: freq=noraman
keyword: PBEPBE/SDD
title: #p freq=noraman PBEPBE/SDD
converged: YES YES NO NO
title: Mulliken charges:
elementType: Cl O O N N C C C C C C C C C C H H H H H H H H H H H H H
charge: -0.092999 -0.287633 -0.489371 -0.640094 -0.119552 -0.218223 0.569519 0.213771 -0.351713 -0.335822 -0.215111 -0.234113 -0.229468 -0.225904 -0.685519 0.231735 0.280242 0.229508 0.179604 0.255852 0.232352 0.235092 0.203282 0.225695 0.232578 0.316590 0.349456 0.370244
chargesum: 0.00000
title: Mulliken charges with hydrogens summed into heavy atoms:
elementType: Cl O O N N C C C C C C C C C C
charge: -0.092999 -0.287633 -0.119127 0.025952 -0.119552 0.013512 0.569519 0.213771 -0.351713 -0.055580 0.194001 0.021739 0.002884 0.009188 -0.023964
polarizability: 1.64186615e+02 -1.60301009e+00 1.25888974e+02 -4.84908052e+00 -2.28915022e+01 1.24109975e+02
1716.lowfreq: -4.0632 -0.0029 -0.0028 -0.0024 4.0477 6.8655 39.8387 41.8191 52.5572
frequency: 39.8215 41.7796 52.5253 71.5438 87.7864 101.1292 145.9959 183.4672 206.0063 234.0169 248.1791 264.6481 296.1452 324.2561 327.5744 338.1132 384.1129 398.9586 443.2119 462.9711 500.6387 539.0324 567.4332 609.2650 640.2879 662.4225 689.5471 732.1803 762.8999 816.9389 824.4604 833.4267 870.0728 873.0630 915.2761 956.4290 991.1040 1004.6493 1015.8371 1038.4031 1060.3047 1072.8112 1114.2871 1122.7829 1137.0283 1171.2516 1198.4422 1249.1146 1258.3760 1265.9318 1287.9372 1303.2183 1367.7966 1373.6417 1383.0047 1396.1912 1424.5819 1459.4984 1461.9572 1479.5264 1489.3730 1574.1424 1588.0989 1608.7576 1631.7882 2934.1365 2937.3979 2993.4940 3021.4139 3090.8417 3101.4768 3138.3000 3155.4175 3171.9658 3179.0702 3522.2099 3606.9489 3669.5062
redmass: 4.9678 3.9274 2.7975 4.1759 3.7319 3.4616 4.9238 6.1438 3.6109 6.2056 1.4319 5.6590 4.2525 2.6550 4.5427 1.2720 6.5780 7.1289 2.7445 1.3498 4.1482 2.3062 2.3808 2.9015 3.4289 5.1659 5.1796 3.6982 1.3151 1.1953 3.5165 3.3322 2.0330 2.3560 3.6526 1.4071 1.3506 6.1177 3.3011 2.0859 1.6832 4.7792 2.0871 1.7688 1.4480 1.0669 1.7289 1.4564 1.2856 1.5382 1.2926 1.2090 2.6980 2.4637 2.3161 1.3310 2.1986 1.0440 2.5151 1.0558 1.0764 6.0621 1.3703 7.2633 3.4115 1.0808 1.0645 1.0358 1.0985 1.0988 1.1013 1.0862 1.0916 1.0947 1.0993 1.0440 1.0679 1.1053
irintensity: 0.8162 1.7969 0.6826 1.3412 4.5991 2.4783 0.9422 1.6368 0.2367 0.9186 1.5527 0.0850 6.2078 10.4733 1.5188 172.6172 19.0862 10.3617 33.3977 93.7803 4.7485 47.4107 44.2729 54.2927 31.4814 45.0733 18.9170 32.0051 58.3408 7.5210 22.3768 5.4224 19.1587 18.9526 8.8294 3.9201 1.0869 48.8627 0.3545 5.8607 79.6404 175.8424 11.0549 5.0507 6.9412 1.6766 4.0649 59.0688 10.4014 20.2072 3.5052 6.5965 6.5561 5.4065 3.7206 25.2318 24.5282 10.5781 28.7952 5.0607 3.8644 13.3290 52.4329 1.5791 158.7151 9.8122 76.8197 26.9481 23.3216 35.3780 35.1611 3.4931 13.8974 3.6786 11.2211 43.5955 45.6527 80.1552
temp: 298.150 k
press: 1.00000 atm
elementType: 17 8 8 7 7 6 6 6 6 6 6 6 6 6 6 1 1 1 1 1 1 1 1 1 1 1 1 1
symmnumber: 1
zpe: 571202.7 jmol-1
zpe.correction: 0.217560 hartree
zpe.thermalcorrener: 0.233397 hartree
zpe.thermalcorrenthalpy: 0.234341 hartree
zpe.thermalcorrgfe: 0.173337 hartree
zpe.sumelectzpe: -1107.684609 hartree
zpe.sumelectthermal: -1107.668772 hartree
zpe.sumelectthermalent: -1107.667828 hartree
zpe.sumelectthermalfe: -1107.728832 hartree
dipole: 0.3861 0.4654 0.1406
dipole: 0.6209
quadrupole: -83.9773 -92.4023 -91.2140
quadrupole: -1.6184 3.3575 -2.9151
quadrupole: 5.2206 -3.2045 -2.0161 -1.6184 3.3575 -2.9151
hfenergy: -1107.9021686 hartree
pointgroup: C01 [X(C10H13Cl1N2O2)]
dipole: -0.1360601 -0.2028226 -0.0046098 debye
polarizability: 162.2381039|-2.433527|117.4773156|8.1618917|21.9015243|134.4701445 unknown
InChI: InChI=1S/C10H13ClN2O2/c1-2-15-9(10(12)13-14)7-5-3-4-6-8(7)11/h3-6,9,14H,2,12H2,1H3
charge 0 multiplicity 1
28 atoms
Cl -1.452148 -1.182194 -2.543629
O  1.411979 1.303774 -0.195586
O  2.377236 -2.396641 1.730762
N  1.083833 -2.396953 -0.489393
N  1.97038 -1.027882 1.268367
C  0.738302 0.068455 -0.568004
C  -0.735174 0.24898 -0.205694
C  1.310692 -1.184326 0.127012
C  -1.799402 -0.25729 -0.980377
C  -1.074693 0.946087 0.982911
C  2.818503 1.381413 -0.643736
C  -3.152578 -0.092838 -0.628446
C  -2.420031 1.127476 1.362314
C  -3.461798 0.608504 0.558141
C  3.324222 2.772892 -0.267574
H  0.832956 -0.10343 -1.663836
H  -0.253614 1.347001 1.584138
H  3.407084 0.589417 -0.141947
H  2.861933 1.221519 -1.744206
H  -3.942256 -0.501089 -1.265296
H  -2.65742 1.671666 2.282403
H  -4.509668 0.744636 0.84582
H  4.378165 2.893461 -0.578477
H  2.720172 3.555838 -0.757715
H  3.26348 2.918511 0.824624
H  0.496881 -2.468151 -1.318268
H  1.405502 -3.23457 -0.00682
H  2.846961 -2.189467 2.57561
