program: Gaussian 09
title: 000036633
version: EM64L-G09RevD.01
frameworkgroup: C1[X(C3H6ClN5O3)]
method: RPBEPBE
basis: SDD
operation: Freq
keyword: #p
keyword: freq=noraman
keyword: PBEPBE/SDD
title: #p freq=noraman PBEPBE/SDD
converged: YES YES NO NO
title: Mulliken charges:
elementType: Cl O O O N N N N N C C C H H H H H H
charge: -0.027201 -0.201756 -0.259111 -0.150911 -0.166074 -0.616988 0.062124 -0.093922 0.051420 -0.323985 -0.579739 0.405051 0.272501 0.283967 0.308904 0.272370 0.368597 0.394754
chargesum: 0.00000
title: Mulliken charges with hydrogens summed into heavy atoms:
elementType: Cl O O O N N N N N C C C
charge: -0.027201 -0.201756 -0.259111 -0.150911 -0.166074 0.146363 0.062124 -0.093922 0.051420 0.232483 0.001534 0.405051
polarizability: 1.28243138e+02 -1.44228183e+01 1.29127678e+02 6.97511448e+00 7.45194117e+00 4.74184506e+01
1716.lowfreq: -9.1499 -5.6117 -3.0127 0.0020 0.0021 0.0023 39.7888 45.5620 71.1324
frequency: 39.7710 45.5520 71.1186 74.9177 97.9694 154.6916 186.3478 229.0268 265.6418 300.1590 341.4905 371.7348 392.2726 434.7928 570.2304 633.2548 661.6237 670.4991 699.0406 704.2382 733.8348 779.9902 786.4433 806.1371 813.4236 907.8361 1030.8835 1051.3215 1080.3803 1088.6379 1161.9778 1218.8043 1265.8967 1315.0807 1347.5091 1369.6626 1396.4383 1434.6620 1456.5223 1473.2499 1484.2737 1591.8642 3044.6749 3071.7718 3122.4599 3164.0195 3381.7755 3595.7451
redmass: 8.9961 12.1936 2.5779 8.5334 7.4078 9.2734 7.0774 9.0525 12.0827 5.1185 5.0373 4.0608 5.1451 9.1826 6.3170 9.1046 2.2078 3.0851 2.8053 6.3315 2.7783 2.1171 1.2132 6.0649 3.4178 2.6314 1.7355 3.7935 6.9784 2.8041 2.8757 1.7788 1.1653 1.2483 1.8971 2.1975 6.7466 1.2572 1.0939 3.0367 1.6083 3.6072 1.0600 1.0564 1.1034 1.1125 1.0524 1.0984
irintensity: 0.7175 1.5318 1.2656 7.2331 0.1081 8.6349 5.2830 4.6539 0.0340 3.2573 3.0850 0.5688 9.3540 7.3698 7.2587 6.6407 67.2918 28.0691 26.3593 52.3092 4.2661 233.7290 180.6948 52.9711 81.2072 89.6059 54.2934 21.1417 235.6323 10.7265 80.0909 40.8446 8.7537 27.1266 210.6026 195.3216 217.8925 33.9195 11.1458 233.5420 20.1638 352.9494 1.2104 11.6910 1.8297 1.9160 102.8314 131.5154
temp: 298.150 k
press: 1.00000 atm
elementType: 17 8 8 8 7 7 7 7 7 6 6 6 1 1 1 1 1 1
symmnumber: 1
zpe: 310548.5 jmol-1
zpe.correction: 0.118282 hartree
zpe.thermalcorrener: 0.130544 hartree
zpe.thermalcorrenthalpy: 0.131489 hartree
zpe.thermalcorrgfe: 0.077518 hartree
zpe.sumelectzpe: -1076.316026 hartree
zpe.sumelectthermal: -1076.303763 hartree
zpe.sumelectthermalent: -1076.302819 hartree
zpe.sumelectthermalfe: -1076.356789 hartree
dipole: -0.0340 3.9864 0.5601
dipole: 4.0257
quadrupole: -92.1226 -85.7306 -72.8328
quadrupole: 12.0192 0.4986 -0.1954
quadrupole: -8.5606 -2.1686 10.7293 12.0192 0.4986 -0.1954
hfenergy: -1076.4343073 hartree
pointgroup: C01 [X(C3H6Cl1N5O3)]
dipole: 0.458266 -1.4700712 0.3706256 debye
dipolederiv: -0.3042195 -0.2184959 0.0439095 -0.2079975 -0.4246775 0.0448753 0.0735725 0.0866271 -0.1975428 -1.1417901 0.8185697 -0.0840565 0.0122793 -0.2516157 0.0303422 0.1215976 -0.0940832 -0.13866 -0.8565169 -0.0883095 0.1015126 -0.3081349 -0.6072687 0.1494775 0.1921259 0.1227169 -0.3003266 -0.6273816 0.2887744 -0.0301127 0.3325898 -0.7877293 0.142707 -0.0293627 0.1349302 -0.2170141 -1.1804518 0.1851523 0.0511985 0.7230363 -0.784528 0.0384923 -0.1908767 0.052902 -0.1516211 -0.6605144 -0.2532161 0.0642522 -0.1244751 -1.0138163 0.1402311 0.0507671 0.1785389 -0.5920733 1.1393359 -1.1135606 0.1364778 -0.8979397 0.6874136 -0.1153987 0.1675857 -0.0553478 -0.0362848 -1.51378 0.6478965 -0.031101 0.7968721 -0.7611784 0.071863 -0.05252 0.0495919 -0.1944299 2.1640966 -0.6183423 -0.0814646 -0.2842843 1.2330736 -0.2937317 -0.2338161 -0.2213193 0.259835 0.1486572 0.1508858 -0.0208862 0.1907423 0.1290139 -0.0086764 0.035928 0.0188125 0.1373887 0.3553461 0.2741581 -0.0621434 0.2759242 0.5396724 -0.1103493 -0.0705269 -0.0768386 0.1768712 1.7334015 -0.0760649 -0.1345504 -0.6059525 1.257515 -0.1988988 -0.0162407 -0.2654289 0.341161 0.0152411 -0.0122394 0.0667089 0.0586546 0.0543937 -0.0421467 -0.0082562 -0.0115258 0.0951834 0.0971932 -0.0191149 -0.0776089 -0.0185634 0.0506169 0.0309517 -0.0776527 0.0056223 0.0495168 -0.0077473 0.0265805 0.0823443 -0.0096758 0.0167969 0.0060091 0.0613451 0.0113275 0.0567396 0.0194304 -0.0326641 -0.0449496 -0.0009955 -0.0145096 0.0981516 -0.0347223 0.0384137 -0.0242752 0.2941668 0.0603658 0.0028494 0.0484931 0.3343475 0.0108131 0.0066478 0.0135272 0.3707582 0.3255328 -0.0203755 0.01762 0.0194269 0.34248 0.0052878 0.0044046 0.0115333 0.3647738 unknown
polarizability: 135.6338206|-13.4792004|118.4952979|-6.1579291|-16.5806288|50.6601488 unknown
InChI: InChI=1S/C3H6ClN5O3/c4-1-2-8(7-10)3(5)6-9(11)12/h1-2,5H2
charge 0 multiplicity 1
18 atoms
Cl 2.981218 2.800252 -0.346904
O  2.73916 -1.987672 0.050139
O  -3.269939 -0.371053 0.394614
O  -2.979043 1.785839 -0.287473
N  0.855517 -0.739712 -0.119547
N  -1.131627 -1.866523 0.523273
N  1.484708 -1.971016 0.224247
N  -1.100785 0.486136 -0.182527
N  -2.519978 0.63067 -0.014014
C  1.605213 0.417338 -0.666254
C  1.917447 1.456233 0.424971
C  -0.552277 -0.721859 0.090696
H  2.543434 0.011858 -1.082883
H  1.002366 0.87924 -1.462007
H  1.007056 1.953729 0.784783
H  2.509479 1.036854 1.251136
H  -0.552845 -2.691968 0.685988
H  -2.148803 -1.824646 0.673263
