program: Gaussian 09
title: 000036644
version: EM64L-G09RevD.01
frameworkgroup: C1[X(C10H14O)]
method: RPBEPBE
basis: SDD
operation: Freq
keyword: #pfreq=noraman
keyword: PBEPBE/SDD
title: #p freq=noraman PBEPBE/SDD
converged: YES YES NO NO
title: Mulliken charges:
elementType: O C C C C C C C C C C H H H H H H H H H H H H H H
charge: -0.471033 0.477244 -0.199181 0.344213 0.322419 -0.575265 -0.445125 -0.418795 -0.705938 -0.820194 -0.810379 0.199615 0.279727 0.227204 0.226571 0.231177 0.240581 0.202789 0.234413 0.223397 0.220954 0.223594 0.224429 0.226197 0.341385
chargesum: 0.00000
title: Mulliken charges with hydrogens summed into heavy atoms:
elementType: O C C C C C C C C C C
charge: -0.129648 0.477244 0.000435 0.344213 0.322419 -0.295538 -0.217920 -0.192224 -0.031391 -0.141429 -0.136159
polarizability: 1.48130867e+02 -2.40897103e+00 1.14890638e+02 -2.04553827e+00 3.31415774e+00 6.75507458e+01
1716.lowfreq: 0.0006 0.0007 0.0011 5.3820 9.0788 17.3570 31.6983 93.9684 113.1003
frequency: 30.5445 93.9485 113.0424 158.1814 172.0971 182.8691 240.9461 263.4653 273.3820 292.4309 325.1457 372.2998 420.8367 450.1594 462.2479 524.3288 560.6408 601.6505 696.6140 730.4425 741.1865 824.3149 855.4657 919.0967 922.1965 947.2819 985.8047 993.6403 1018.8531 1030.8352 1053.9850 1059.3601 1079.0296 1121.8285 1152.9937 1193.0472 1219.3523 1254.1592 1280.3106 1298.1093 1371.7115 1383.3191 1388.7089 1392.0066 1404.2571 1410.9520 1462.6526 1464.5305 1468.7086 1470.4757 1475.2562 1478.4177 1502.9661 1587.6839 1627.6446 2938.5056 2966.0472 2967.4680 2972.7879 3036.0597 3040.2142 3066.9850 3080.4046 3084.8798 3093.6003 3104.8359 3130.8810 3153.1211 3566.8203
redmass: 3.5032 3.1727 1.0623 1.0840 3.4724 2.6299 2.3425 1.2031 1.1468 2.4527 3.3432 3.5846 2.9429 2.8691 3.0244 4.8186 3.9725 3.1013 3.7162 2.7794 3.9788 1.3476 2.7265 1.5504 2.1969 1.3482 1.6191 1.5236 1.8245 1.4537 1.6468 2.1835 2.0895 1.9012 1.4128 1.6699 1.4813 2.6674 1.3264 1.2328 3.1866 1.9088 1.3026 1.2448 1.3161 2.5166 1.0499 1.0494 1.2204 1.0931 1.0545 1.1184 2.5449 6.5352 6.4947 1.0839 1.0375 1.0382 1.0377 1.0969 1.0968 1.0970 1.0983 1.0977 1.1001 1.0869 1.0965 1.0913 1.0660
irintensity: 2.9469 3.5820 0.2300 0.5726 3.6879 1.0500 0.3529 4.5791 127.2295 3.6500 26.8054 4.0000 2.0410 6.3821 1.3369 1.5015 6.6534 8.6339 3.2234 4.7573 0.8032 34.2263 15.5650 5.2756 19.0605 0.4238 9.3425 9.7615 2.3179 19.1005 0.0166 77.1008 11.2177 28.2618 13.3839 19.2333 5.4952 0.5316 6.0831 8.0219 9.4380 23.9795 11.3994 5.3541 15.6208 2.7968 1.0760 14.3617 17.2039 8.8283 26.6047 5.5373 27.9162 1.7943 4.1324 52.5030 69.3447 15.3430 36.4764 46.8746 2.1044 46.3733 32.7305 12.6962 21.6494 15.2565 32.3465 1.4830 3.8889
temp: 298.150 k
press: 1.00000 atm
elementType: 8 6 6 6 6 6 6 6 6 6 6 1 1 1 1 1 1 1 1 1 1 1 1 1 1
symmnumber: 1
zpe: 556311.5 jmol-1
zpe.correction: 0.211888 hartree
zpe.thermalcorrener: 0.223836 hartree
zpe.thermalcorrenthalpy: 0.224780 hartree
zpe.thermalcorrgfe: 0.174083 hartree
zpe.sumelectzpe: -463.851387 hartree
zpe.sumelectthermal: -463.839439 hartree
zpe.sumelectthermalent: -463.838495 hartree
zpe.sumelectthermalfe: -463.889192 hartree
dipole: 0.8608 -0.8119 0.8520
dipole: 1.4581
quadrupole: -51.5075 -64.0984 -71.0287
quadrupole: -1.7578 0.4349 1.9472
quadrupole: 10.7040 -1.8869 -8.8171 -1.7578 0.4349 1.9472
hfenergy: -464.0632752 hartree
pointgroup: C01 [X(C10H14O1)]
dipole: 0.3261256 -0.2073106 0.423976 debye
dipolederiv: -0.3445536 -0.1524259 0.159647 -0.2023729 -0.6018713 0.0931692 0.2098645 0.092677 -0.7078444 0.1830987 0.0112783 0.0403215 0.0173104 -0.040381 0.015749 0.0385868 -0.0001696 -0.0844813 0.4914305 0.1099102 -0.0964748 0.1890967 0.5179256 -0.0786577 -0.2138798 -0.0920432 0.5398376 0.0304837 -0.1924358 0.0323807 -0.2195591 0.2260573 -0.0517433 0.0526477 -0.0513427 -0.0360842 0.3048621 0.0358055 -0.0285047 0.0511123 -0.1398808 0.015306 -0.0324066 0.0173847 -0.0550944 -0.1674583 0.1033156 -0.0453054 0.0450414 -0.0443377 -0.0234408 -0.0607521 -0.0473359 -0.1411073 -0.1107051 -0.0330328 -0.0153824 -0.0563683 0.0157866 -0.0380344 0.0085417 -0.0332858 -0.1703557 -0.0805494 0.0050824 -0.0074744 0.0858048 0.0715597 -0.0464305 -0.0223218 -0.0466244 -0.1602156 -0.0556974 -0.0051489 -0.0905364 -0.0686883 -0.0009258 0.0094324 0.0267422 0.0378528 -0.1726012 -0.0339744 0.1356188 -0.0253115 0.0824174 -0.0403994 0.0202441 -0.0118772 0.0219622 0.0679561 -0.1343424 -0.0051424 0.0108777 0.0596426 0.0914832 -0.0045427 -0.0013879 -0.0028487 0.0724364 -0.0578637 0.0387733 0.0431977 0.0552754 -0.179865 -0.0620284 0.0384825 -0.0612356 -0.0482838 0.1253809 -0.0380832 0.0125966 -0.0654146 -0.0265475 0.0326739 0.0046827 0.0358106 0.1370511 -0.0018688 0.1192138 -0.0075078 0.1135126 -0.046868 0.0333895 -0.0076809 0.032272 0.1383031 0.0125837 -0.1049005 0.0250387 -0.0870884 -0.0824929 0.0467857 0.0256177 0.0489964 0.1386123 0.1054777 -0.0691998 0.0406024 -0.0441888 -0.0502544 0.1159888 0.0493604 0.0810735 0.0133046 0.0819963 0.0794359 0.0307435 0.0386892 -0.052419 -0.1112549 0.0107638 -0.052252 0.0347487 -0.2783816 -0.0096534 -0.0217424 -0.0240645 0.1005539 -0.0122181 -0.0124489 0.0012908 0.0513739 0.0096759 -0.1634787 0.0378619 -0.0536163 -0.0637264 0.0356767 0.0149954 0.0403263 0.0974442 -0.0279241 0.0410409 -0.1294801 0.0019571 0.0448185 -0.041421 -0.1404724 0.0200847 -0.0394061 -0.0081594 0.0815644 0.0994839 0.0584445 0.038609 0.0032594 0.1269791 -0.0637755 -0.0548322 -0.0195541 0.0255391 0.0431266 0.0748968 0.0100436 -0.1253443 0.1028806 -0.0957594 -0.0182613 -0.0380728 0.0144983 -0.0578081 0.0399792 0.0836688 0.0795643 -0.1287719 0.0537726 -0.0745607 0.0546747 -0.0134478 0.0048545 -0.1322658 -0.1312536 0.0533271 0.0290635 0.0484933 0.0961706 -0.040559 -0.0141273 -0.0552048 0.0404467 0.3007165 0.0405498 -0.1072089 0.0146759 0.3758896 unknown
polarizability: 148.108327|-2.8293329|112.6224753|0.809656|-10.7844818|69.8414492 unknown
InChI: InChI=1S/C10H14O/c1-7-4-5-10(9(3)11)6-8(7)2/h4-6,9,11H,1-3H3
charge 0 multiplicity 1
25 atoms
O  2.846467 1.033106 -0.912479
C  0.951013 -0.224189 -0.080768
C  2.473162 -0.155334 -0.119028
C  -1.255016 0.884337 -0.18117
C  -1.899056 -0.358148 0.105615
C  0.157438 0.931128 -0.267235
C  0.309102 -1.454039 0.194139
C  -1.098294 -1.512531 0.287282
C  3.083744 -0.071781 1.300189
C  -2.072093 2.146249 -0.398858
C  -3.411737 -0.448394 0.205529
H  2.860037 -1.06952 -0.621451
H  0.661612 1.87316 -0.504546
H  0.902206 -2.368056 0.328134
H  -1.587003 -2.4718 0.497974
H  2.779758 -0.940598 1.910919
H  2.734971 0.845195 1.807155
H  4.190849 -0.056341 1.258465
H  -1.420132 3.012773 -0.600464
H  -2.766618 2.039476 -1.255082
H  -2.694836 2.387596 0.484622
H  -3.808354 0.210992 1.001967
H  -3.902222 -0.135538 -0.736751
H  -3.736228 -1.47924 0.428569
H  3.82643 1.161197 -0.849626
