program: Gaussian 16
title: from ts-2.5 IRC (ircr)
version: ES64L-G16RevA.03
method: RMN15
basis: Gen
operation: Freq
keyword: #NGeom=AllCheck
keyword: Guess=TCheck
keyword: SCRF=Check
keyword: GenChk
keyword: RMN15/ChkBas
keyword: Freq
converged: YES YES NO YES
title: Mulliken charges:
elementType: C C C C C H H H N C C O O N C C C H Pd C H C C C C H C C H H C C C H N C C C C C H C H C C H C H H H N Pd N O C O C H H N C H C O H H H H C C C C H C H C C H H C C C H C C C H H N H H C H C C H H O O C H H C H H H
charge: 0.066250 0.065956 -0.000263 0.091007 -0.001846 0.017394 0.017527 0.018817 -0.163849 0.154586 0.153554 -0.225447 -0.217213 -0.309882 0.102731 0.018407 -0.015057 0.015041 0.149762 0.043186 -0.032970 0.114949 -0.028592 -0.123512 0.048770 0.006688 0.045456 0.023807 0.006138 0.001855 0.019781 -0.117803 0.042518 -0.024682 -0.310484 -0.008327 0.124281 0.106331 0.196742 0.040023 0.074034 0.068971 0.010303 -0.225059 0.081859 0.010281 0.057185 0.003547 0.009862 0.014570 -0.152286 -0.186183 0.186895 -0.319750 0.142132 -0.290785 0.192940 0.033320 0.054484 -0.177670 -0.000750 0.127639 0.047268 -0.259051 0.018715 0.040762 0.037072 -0.003503 0.108657 0.024054 0.031287 0.007670 -0.052757 0.001710 -0.016589 0.032892 0.134125 -0.011664 -0.020353 -0.038480 -0.119551 0.045943 -0.004423 0.045481 -0.223624 0.007593 -0.002147 -0.000545 0.115583 -0.000844 -0.034285 0.018822 0.040598 0.246508 0.194566 0.014427 -0.003859 -0.225056 -0.278758 0.117894 0.041999 0.022511 -0.006147 0.017799 0.025042 0.035490
chargesum: -0.00000
title: Mulliken charges with hydrogens summed into heavy atoms:
elementType: C C C C C N C C O O N C C C Pd C C C C C C C C C C N C C C C C C C C C N Pd N O C O C N C C O C C C C C C C C C C C C C N C C C O O C C
charge: 0.066250 0.065956 0.017130 0.108533 0.016970 -0.163849 0.154586 0.153554 -0.225447 -0.217213 -0.309882 0.102731 0.033449 -0.015057 0.149762 0.010216 0.114949 -0.021903 -0.123512 0.054908 0.041953 0.025662 -0.014504 -0.117803 0.017836 -0.310484 -0.008327 0.198315 0.116634 0.196742 0.050304 0.072518 -0.225059 0.091721 0.071755 -0.152286 -0.186183 0.186895 -0.319750 0.142132 -0.290785 0.280744 -0.050031 -0.000750 0.143816 -0.259051 0.108657 -0.028703 0.014698 0.007670 -0.009954 0.012539 0.134125 -0.042903 -0.119551 0.043796 0.044936 -0.223624 0.006749 0.115583 0.059420 0.257076 0.194566 -0.225056 -0.278758 0.182404 0.072184
chargesum: -0.00001
1716.lowfreq: -0.8065 -0.0018 -0.0010 0.0022 2.5847 4.1959 13.6927 16.2644 23.7560
redmass: 6.1506 6.4401 6.3387 6.2247 6.9304 7.6868 6.4922 6.5653 4.1566 7.0691 6.2647 5.8033 4.8328 4.2828 2.8881 5.2043 4.3543 2.4710 5.8946 5.0260 4.1902 6.6443 5.1503 5.6028 8.1208 5.9695 7.0343 6.1330 6.0263 5.1302 6.5411 6.2979 6.0325 7.4002 6.3462 5.0662 6.2282 6.6231 2.2147 6.3595 5.4667 5.4983 6.0414 5.6945 6.7250 5.5742 3.7766 3.5233 4.8716 5.9518 4.2138 4.1887 5.9682 5.0668 4.9912 5.6982 7.2803 6.4383 7.1164 5.5606 5.6125 6.6663 2.9472 6.3555 5.8224 5.0562 4.5106 8.7699 5.5533 4.6735 4.1108 4.0547 4.5093 3.9296 6.5794 3.8231 3.6545 4.4803 3.9620 3.5209 3.9118 4.3212 4.6800 6.0218 6.6512 5.3177 5.7936 4.6474 4.4396 6.1065 1.7003 3.2270 2.9236 4.9951 6.8579 4.5541 4.5094 4.0986 4.8492 5.4753 3.1944 6.6047 7.1270 7.5730 4.1914 5.2922 5.0040 3.3189 3.4228 7.4658 4.6565 6.4658 6.6012 5.0029 3.7426 2.6058 2.1252 4.3264 1.5339 5.2392 2.8673 2.9184 3.6088 4.0147 2.4965 1.7211 1.5415 2.4670 1.3645 2.7813 4.7692 1.3506 1.7556 1.5328 3.5814 2.4595 2.9335 3.0746 4.4053 2.0952 1.4822 1.5617 1.4992 2.0259 2.9543 1.6496 3.9214 1.5670 1.9011 1.9466 1.4437 1.3961 1.9357 2.8570 1.6117 2.3161 4.5882 2.6792 1.5876 1.7913 4.3511 1.3999 2.2482 1.3743 2.1826 1.3829 1.3887 1.3870 1.8110 2.2800 1.3946 1.3745 2.4871 2.4295 1.8111 2.3676 1.8601 2.2744 1.4529 1.5556 2.1099 2.5603 2.2362 2.0178 1.5190 1.4859 1.1296 1.1288 1.0905 1.0785 1.0782 1.2962 1.1193 1.6907 2.0889 2.9570 3.0981 1.3386 1.1905 2.5433 2.4602 1.8580 1.8419 2.0472 1.4512 2.2872 1.9066 1.6353 1.5792 1.7161 1.7022 1.7578 1.6167 1.7299 2.3282 1.1930 3.7063 1.3317 1.4125 8.6208 8.3553 7.0291 4.3756 6.1017 6.3304 1.7278 4.6681 2.8994 1.0656 3.3364 2.0063 1.5732 1.0889 1.1228 1.2829 1.3254 1.0936 4.0903 5.5226 3.9712 2.9235 2.8577 1.4175 2.9803 4.7001 3.1208 3.4907 3.4985 4.2957 4.0287 3.8087 3.4587 5.2143 6.9420 7.0255 6.9461 7.2699 7.3109 7.2441 7.3828 8.8939 7.0194 7.3432 7.1795 7.6332 8.1705 11.7376 12.8334 12.8263 11.5995 10.6572 12.6801 12.7065 1.0448 1.0616 1.0374 1.0623 1.0606 1.0979 1.1005 1.0945 1.1058 1.1016 1.1054 1.0905 1.1052 1.0915 1.0913 1.1057 1.0868 1.0897 1.0882 1.0879 1.0927 1.0909 1.0914 1.0914 1.0909 1.0958 1.0930 1.0957 1.0960 1.0965 1.0989 1.1005 1.1003 1.0958 1.0944 1.0978 1.0953 1.0944 1.0776
irintensity: 0.0405 0.2909 0.2507 0.1426 0.1931 0.2021 0.8854 1.3234 1.5103 0.1604 0.1636 2.1884 1.3898 1.4445 0.4094 5.3294 1.0175 7.9744 5.6385 0.2569 5.2034 5.6414 0.2525 0.5743 2.7233 1.7613 1.4620 4.9787 0.6735 0.9699 14.0371 0.7503 0.8543 4.5410 1.7234 0.5733 0.7346 1.1516 0.1450 2.2245 0.5297 0.4450 2.8357 1.1534 0.3037 4.4945 2.7517 2.7451 3.5945 2.8659 2.7259 0.9158 2.7856 3.3201 2.5250 1.0018 6.4064 2.9761 8.4371 5.8102 5.5708 6.0377 10.8492 4.5340 4.7263 15.2009 13.4200 10.2401 2.7849 0.6141 7.2350 12.3093 4.3941 5.4072 1.8564 8.4578 1.4528 2.8510 4.0599 3.0210 0.1525 2.6104 0.9794 1.0078 1.2359 5.5109 2.4710 1.8881 1.5042 11.7003 73.3857 5.4145 34.9370 4.4464 0.9177 11.7966 8.5764 24.9015 5.5500 4.9741 2.1009 0.7351 9.1161 16.6298 0.8468 5.1498 0.6611 4.0919 3.7933 12.8950 1.1240 2.9402 1.3175 53.5701 14.0422 8.2966 11.4597 0.6029 1.1509 3.3420 17.2629 9.3593 25.6990 1.9735 5.2245 13.9912 72.8116 7.4169 2.2533 4.0400 4.5214 58.1733 6.0235 27.7923 8.3961 9.9541 1.1328 3.3008 8.0725 0.6702 6.4657 4.1482 0.7740 5.9992 8.7121 0.7751 6.4598 6.3673 8.6144 5.6066 2.9059 0.4752 3.2374 8.1110 6.6465 0.1731 1.7860 1.1491 10.7317 0.1335 36.5461 0.1599 15.1783 4.1347 5.1420 0.1128 2.6371 0.1109 5.4571 9.0889 0.6254 0.4865 6.3899 0.1307 7.7480 2.3512 1.9867 0.4322 1.4618 12.1089 3.1772 16.0528 6.4034 11.8542 1.9067 3.5205 2.1349 3.7328 0.4766 2.2362 0.8455 3.3991 2.0872 1.9592 24.4161 17.2061 4.0425 2.6518 23.5799 1.9688 5.2013 47.0748 1.1754 10.1767 15.7458 307.0276 0.2892 18.1325 4.0106 2.8713 1.7285 0.8788 23.4499 7.5837 7.6915 23.8037 2.1869 8.6984 16.6037 14.4417 8.4382 14.5040 28.6640 5.7815 42.2731 185.9934 16.5716 4.0632 52.1162 242.3672 117.1821 34.1727 33.5167 20.7571 29.1102 100.6238 3.5152 25.1172 8.3833 70.2262 410.1421 11.3568 253.2727 18.7785 110.4987 1.1462 140.0421 197.5284 0.1060 20.8363 10.4874 317.4346 31.7966 17.7492 34.3213 20.8583 17.4711 20.4458 6.1725 40.4663 2.9644 9.0072 36.7058 18.3171 108.0674 22.6399 176.9859 440.5624 556.7515 152.8178 306.6037 22.5565 106.8708 1.7313 24.9990 19.3309 9.5234 16.0744 7.8476 2.6483 2.7905 2.2833 8.3726 15.1341 0.7645 9.7400 1.0742 2.3077 5.9295 0.5591 4.3904 6.9901 0.9773 0.1199 1.4756 2.8736 0.3023 7.8187 3.0181 0.2021 5.6567 3.0683 1.9684 0.5732 4.4732 7.9890 0.7810 4.5627 0.2165 0.0579 5.0219 102.9680
temp: 353.000 k
press: 1.00000 atm
elementType: 6 6 6 6 6 1 1 1 7 6 6 8 8 7 6 6 6 1 46 6 1 6 6 6 6 1 6 6 1 1 6 6 6 1 7 6 6 6 6 6 1 6 1 6 6 1 6 1 1 1 7 46 7 8 6 8 6 1 1 7 6 1 6 8 1 1 1 1 6 6 6 6 1 6 1 6 6 1 1 6 6 6 1 6 6 6 1 1 7 1 1 6 1 6 6 1 1 8 8 6 1 1 6 1 1 1
symmnumber: 1
zpe: 2130999.6 jmol-1
zpe.correction: 0.811655 hartree
zpe.thermalcorrener: 0.891857 hartree
zpe.thermalcorrenthalpy: 0.892975 hartree
zpe.thermalcorrgfe: 0.685755 hartree
zpe.sumelectzpe: -3125.767707 hartree
zpe.sumelectthermal: -3125.687505 hartree
zpe.sumelectthermalent: -3125.686387 hartree
zpe.sumelectthermalfe: -3125.893607 hartree
dipole: 4.6155 3.9666 -5.9809
dipole: 8.5328
quadrupole: -461.7409 -390.6777 -372.5796
quadrupole: 5.8241 14.3019 -3.8233
quadrupole: -53.4082 17.6551 35.7531 5.8241 14.3019 -3.8233
hfenergy: -3126.5793619 hartree
pointgroup: C01 [X(C51H39N7O7Pd2)]
dipole: 2.1338519 1.4423274 -2.1531623 debye
polarizability: 775.1515406|41.6052339|713.742009|82.8533841|-53.1757749|539.9149126 unknown
InChI: InChI=1S/C33H19N5O2.C14H14NO2.C4H6NO3.2Pd/c34-20-24-8-1-3-14-28(24)22-10-5-12-26(18-22)36-32(39)30-16-7-17-31(38-30)33(40)37-27-13-6-11-23(19-27)29-15-4-2-9-25(29)21-35;1-2-17-14(16)9-8-11-5-3-7-13-12(11)6-4-10-15-13;1-3(6)5-2-4(7)8;;/h1-19H;3-7,9-10H,2,8H2,1H3;5H,2H2,1H3;;/q-3;2*-1;+1;+4
charge 0 multiplicity 1
106 atoms
C  6.05572405 0.42219535 1.20737516
C  4.94343813 2.50512218 1.23160047
C  6.14364372 3.18619175 1.41298759
C  7.32140563 2.4340272 1.50156644
C  7.28835257 1.03701839 1.40436235
H  6.12039556 4.27472506 1.48419405
H  8.2766857 2.94213715 1.65057781
H  8.17880384 0.41002523 1.47246311
N  4.95617554 1.17554069 1.12756694
C  5.81838385 -1.06766894 1.05180256
C  3.567286 3.13064834 1.13450044
O  3.44801765 4.34772778 1.10088292
O  6.74972718 -1.85432754 1.13239319
N  2.58729854 2.18220444 1.11323111
C  1.23713484 2.55075538 0.96096564
C  -1.10041852 2.07508456 1.44661989
C  -0.52637508 3.71405177 -0.23851173
H  -1.86607269 1.5149512 1.98724872
Pd 3.26102667 0.26666999 0.93279894
C  -1.49549714 2.99283724 0.47510706
H  -2.56040443 3.1281712 0.27544256
C  -0.93085977 4.642967 -1.32184635
C  -0.47597142 5.96590621 -1.37532637
C  -1.77638699 4.19734591 -2.36524521
C  -0.87558753 6.81893688 -2.40392883
H  0.18699092 6.32204703 -0.58328027
C  -2.18493844 5.05457809 -3.39944949
C  -1.73661928 6.37109583 -3.41176027
H  -0.51638524 7.85023903 -2.41740513
H  -2.04998735 7.046596 -4.20947204
C  0.8335736 3.50572329 0.01621489
C  -2.14538019 2.81161054 -2.36610759
C  0.25489138 1.86853729 1.69686842
H  0.5814271 1.14925035 2.45145912
N  4.50737239 -1.33275451 0.78506218
C  0.61531027 -0.88609763 -0.12155098
C  1.38179395 -1.64381141 1.94738518
C  0.82911775 -0.06556324 -1.27517337
C  -0.47779959 -1.79510531 -0.08073603
C  0.33519261 -2.56359019 2.06280573
H  2.157886 -1.57135002 2.71484089
C  0.03752654 -0.21982556 -2.37537121
H  1.65862906 0.64703753 -1.2511383
C  -1.34242015 -1.91672296 -1.23878478
C  -0.60191426 -2.63344118 1.05052258
H  0.27546761 -3.21398941 2.93481856
C  -1.04856784 -1.16141728 -2.37894763
H  0.22219246 0.37307738 -3.27329865
H  -1.42815461 -3.33548203 1.12558619
H  -1.52516592 -1.42276819 -3.33042116
N  1.51445386 -0.82967451 0.90265489
Pd -2.98295958 -0.23215863 -1.64182654
N  -2.37576288 1.67858944 -2.30129623
O  -4.84527601 0.52134747 -1.43046699
C  -5.02621787 1.03284815 -0.2644915
O  -4.15989382 1.16000927 0.60363982
C  -6.45365232 1.4862537 0.00234595
H  -6.72176412 2.25749979 -0.73989602
H  -7.13617695 0.63925258 -0.16759357
N  -6.58022407 1.94330662 1.36131339
C  -7.63294057 1.57744339 2.14641853
H  -5.70028667 2.21583399 1.79748301
C  -7.47203561 1.89672358 3.61711593
O  -8.61607826 1.00047063 1.70791147
H  -6.82578564 2.7674338 3.79276511
H  -8.46302237 2.06661721 4.053882
H  -7.02441067 1.02415016 4.11860951
H  -2.83841459 4.676942 -4.18783675
C  4.07365411 -2.63741756 0.48595985
C  3.19571343 -2.799429 -0.59416842
C  4.41232202 -3.76224186 1.25312533
C  2.58703592 -4.02671025 -0.87593767
H  2.95849565 -1.91639009 -1.19394044
C  3.83293066 -4.99820498 0.95998326
H  5.12499608 -3.65485947 2.07161117
C  2.91375004 -5.13779147 -0.08013416
C  1.65335301 -4.12206386 -2.02635509
H  4.10032234 -5.87138887 1.55909981
H  2.47479481 -6.11485127 -0.29128367
C  1.95491617 -3.46118726 -3.22849875
C  0.4451128 -4.85607375 -1.97596464
C  1.11611334 -3.53989225 -4.33830504
H  2.88916795 -2.89920088 -3.29290324
C  -0.38765268 -4.9556816 -3.10462003
C  -0.02536466 -5.45532758 -0.75383417
C  -0.05672785 -4.29874512 -4.28498296
H  1.39057949 -3.02096821 -5.2593596
H  -1.30622637 -5.54163862 -3.0309471
N  -0.47762516 -5.91015376 0.21496765
H  -0.70646677 -4.3803438 -5.15839203
H  1.59000197 4.05154872 -0.5506381
C  -3.7255267 -2.02919603 -1.08561707
H  -4.57062865 -2.20215466 -1.76323763
C  -2.50100628 -2.89958417 -1.29888149
C  -4.16534796 -1.92477281 0.33449951
H  -2.40722865 -3.72234545 -0.57541337
H  -2.5255562 -3.33587488 -2.30777049
O  -3.42945631 -2.07518615 1.29176557
O  -5.47054259 -1.66880322 0.45155283
C  -5.9832207 -1.44759355 1.76998171
H  -6.95392081 -0.95554278 1.61612342
H  -5.30361611 -0.75149935 2.28788831
C  -6.15570621 -2.74115977 2.54002775
H  -6.62726056 -2.53450143 3.51187284
H  -6.80569951 -3.43512658 1.98775437
H  -5.1844736 -3.22055288 2.71823145
