program: Gaussian 09
title: 000036638
version: EM64L-G09RevD.01
frameworkgroup: C1[X(C10H12Cl2N2O2)]
method: RPBEPBE
basis: SDD
operation: Freq
keyword: #p
keyword: freq=noraman
keyword: PBEPBE/SDD
title: #p freq=noraman PBEPBE/SDD
converged: YES YES NO NO
title: Mulliken charges:
elementType: Cl Cl O O N N C C C C C C C C C C H H H H H H H H H H H H
charge: -0.060015 -0.023154 -0.297336 -0.482701 -0.634340 -0.124047 -0.211136 0.742243 0.161604 -0.347117 -0.278929 -0.206826 -0.238297 -0.241278 -0.221880 -0.681603 0.250262 0.198630 0.208420 0.262101 0.260007 0.240791 0.209939 0.234549 0.223515 0.343215 0.346134 0.367250
chargesum: 0.00000
title: Mulliken charges with hydrogens summed into heavy atoms:
elementType: Cl Cl O O N N C C C C C C C C C C
charge: -0.060015 -0.023154 -0.297336 -0.115450 0.055008 -0.124047 0.039126 0.742243 0.161604 -0.347117 -0.278929 0.200224 0.023804 0.018729 0.018910 -0.013600
polarizability: 1.70417881e+02 6.77065316e+00 1.35444615e+02 6.81271845e+00 -1.14552996e+01 1.37315105e+02
1716.lowfreq: -8.8481 -2.7812 0.0014 0.0021 0.0025 5.2518 31.0479 48.5244 52.0331
frequency: 30.9976 48.4396 52.0323 54.6766 67.5207 90.3647 99.1238 175.6617 192.5610 202.0401 221.5108 241.8914 252.4725 277.0166 308.3745 323.0885 336.6505 343.6546 369.4133 392.4033 440.1583 491.9435 521.6472 525.6623 559.6084 571.2885 617.7851 637.6258 693.0573 727.7249 740.6250 779.4994 811.0008 828.3128 839.2632 877.3945 894.9188 947.5223 969.7326 992.4886 1044.6522 1054.5310 1067.9460 1071.3818 1117.4974 1137.7805 1151.9291 1185.1420 1206.4141 1252.8065 1271.0841 1288.8733 1312.8803 1370.2363 1380.4418 1394.9515 1405.4526 1418.5235 1427.1937 1460.9746 1478.6386 1490.9351 1554.0801 1563.0921 1592.1796 1639.4452 2946.7591 2978.9609 2994.2876 3003.7857 3092.2784 3100.8956 3151.6699 3173.4980 3184.4163 3537.4349 3608.1876 3691.2077
redmass: 6.2521 2.2712 4.5839 3.1545 5.4689 8.3436 5.5516 5.8798 4.5787 7.5514 3.7742 1.8070 3.6873 8.3342 3.8404 1.2298 3.3342 5.3590 6.0746 9.0064 6.6914 4.2569 1.7011 4.9208 1.6044 2.9292 1.7036 4.7012 4.8390 7.3712 3.2722 1.5587 1.2031 4.2057 4.7137 4.0969 1.3613 4.4789 1.3394 4.0378 4.2459 3.1530 2.4260 1.9884 2.1446 1.4647 1.5058 1.4544 2.2564 1.1396 1.3290 1.3008 1.4684 1.7629 2.1319 1.3886 3.1025 2.3001 2.7795 1.0410 1.0521 1.0772 1.2269 6.5067 8.1262 6.4996 1.0571 1.0821 1.0359 1.1053 1.0991 1.1012 1.0875 1.0929 1.0995 1.0427 1.0679 1.1053
irintensity: 0.0550 0.5342 0.1337 2.4100 2.6087 0.8092 1.3666 1.3986 0.0032 1.6715 0.4928 2.4541 1.3184 0.4750 9.2437 151.4607 18.8370 7.8122 5.5818 16.7396 4.7298 4.5126 54.4888 2.5697 136.5884 47.3134 10.2919 23.4807 22.4579 73.9553 8.4613 55.1116 4.5351 20.5797 31.2417 68.5640 0.0107 24.8599 1.8837 25.0780 10.7163 178.0231 48.1139 7.4577 15.5199 4.5122 12.5789 15.8841 19.5137 1.9468 42.6479 9.8043 25.8747 3.7808 1.2974 36.1262 3.4369 48.3932 14.9214 11.4046 9.3101 3.2373 126.3825 49.5440 29.0186 157.2548 39.6195 14.2444 23.1053 33.6283 29.3952 33.6611 4.5170 1.4373 7.3119 59.3399 41.5731 77.5040
temp: 298.150 k
press: 1.00000 atm
elementType: 17 17 8 8 7 7 6 6 6 6 6 6 6 6 6 6 1 1 1 1 1 1 1 1 1 1 1 1
symmnumber: 1
zpe: 546391.9 jmol-1
zpe.correction: 0.208110 hartree
zpe.thermalcorrener: 0.225250 hartree
zpe.thermalcorrenthalpy: 0.226194 hartree
zpe.thermalcorrgfe: 0.161750 hartree
zpe.sumelectzpe: -1567.071908 hartree
zpe.sumelectthermal: -1567.054768 hartree
zpe.sumelectthermalent: -1567.053823 hartree
zpe.sumelectthermalfe: -1567.118268 hartree
dipole: -1.4417 1.4457 1.3432
dipole: 2.4439
quadrupole: -95.4178 -97.7842 -109.5179
quadrupole: 4.8663 -4.7816 -0.6940
quadrupole: 5.4888 3.1224 -8.6112 4.8663 -4.7816 -0.6940
hfenergy: -1567.2800179 hartree
pointgroup: C01 [X(C10H12Cl2N2O2)]
dipole: -0.6959772 0.605401 0.2713053 debye
polarizability: 164.7416573|12.7728962|133.0495006|11.7994911|-7.2781414|145.3864431 unknown
InChI: InChI=1S/C10H12Cl2N2O2/c1-2-16-9(10(13)14-15)8-6(11)4-3-5-7(8)12/h3-5,9,15H,2,13H2,1H3
charge 0 multiplicity 1
28 atoms
Cl -1.540417 0.257744 -2.761308
Cl 0.376254 -0.457436 2.500853
O  1.087892 1.635762 0.190879
O  2.876922 -2.610982 -0.477281
N  3.084769 -0.0667 -0.016119
N  1.594274 -1.852697 -0.63346
C  0.711276 0.41339 -0.543362
C  -0.643926 -0.140918 -0.107771
C  1.85995 -0.581339 -0.358128
C  -1.733679 -0.25086 -1.007715
C  -0.916972 -0.553102 1.223875
C  0.247872 2.802585 -0.145945
C  -3.000616 -0.744851 -0.644436
C  -2.16773 -1.049821 1.634051
C  -3.21328 -1.147103 0.690591
C  0.843039 4.0086 0.57801
H  0.649378 0.660371 -1.622961
H  0.245059 2.949521 -1.247532
H  -0.794901 2.615436 0.182629
H  -3.797966 -0.813434 -1.388747
H  -2.317428 -1.357341 2.672409
H  -4.190269 -1.535245 0.995047
H  0.238692 4.911372 0.375488
H  0.858352 3.835293 1.667762
H  1.876708 4.197867 0.2401
H  3.130533 0.900527 0.29742
H  3.861187 -0.714835 0.096485
H  2.58333 -3.536704 -0.661435
