program: Gaussian 16
title: Guessts-2.5 FFIAIA Template-1
version: ES64L-G16RevA.03
method: RMN15
basis: Gen
operation: Freq
keyword: #NGeom=AllCheck
keyword: Guess=TCheck
keyword: SCRF=Check
keyword: GenChk
keyword: RMN15/ChkBas
keyword: Freq
title: Guess ts-2.5 FFIAIA Template-1
converged: YES YES NO YES
title: Mulliken charges:
elementType: C C C C C H H H N C C O O N C C C H Pd C H C C C C H C C H H C C C H N C C C C C H C H C C H C H H H N Pd N O C O C H H N C H C O H H H H C C C C H C H C C H H C C C H C C C H H N H H C H C C H H O O C H H C H H H
charge: 0.067926 0.068032 -0.002010 0.089159 -0.001484 0.018046 0.019129 0.020307 -0.164563 0.158104 0.154644 -0.222360 -0.214762 -0.314195 0.115862 0.000443 0.000871 -0.015432 0.132832 0.026202 -0.017202 0.132479 -0.039552 -0.135244 0.051604 0.011305 0.047878 0.023182 0.007374 0.005417 0.018033 -0.109775 0.040996 -0.018102 -0.317757 -0.044369 0.101772 0.131010 0.115316 0.053547 0.071650 0.008048 0.014273 -0.098150 0.032648 0.013942 0.074967 -0.001585 0.010648 0.019756 -0.126330 -0.053972 0.160103 -0.322927 0.141243 -0.288537 0.209870 0.038625 0.039513 -0.198861 0.004527 0.134586 0.050568 -0.267058 0.003867 0.044203 0.042773 0.007067 0.114012 0.036036 0.031740 -0.004128 -0.059551 -0.000266 -0.016543 0.036472 0.136429 -0.010922 -0.020371 -0.042887 -0.125546 0.052446 -0.005787 0.040649 -0.223252 0.014741 -0.000507 -0.001834 0.113941 0.005993 -0.031208 -0.039988 0.027232 0.130391 0.208721 0.070469 0.034384 -0.213481 -0.283121 0.135774 0.015959 0.046391 -0.012977 0.022221 0.022436 0.035812
chargesum: -0.00000
title: Mulliken charges with hydrogens summed into heavy atoms:
elementType: C C C C C N C C O O N C C C Pd C C C C C C C C C C N C C C C C C C C C N Pd N O C O C N C C O C C C C C C C C C C C C C N C C C O O C C
charge: 0.067926 0.068032 0.016036 0.108289 0.018823 -0.164563 0.158104 0.154644 -0.222360 -0.214762 -0.314195 0.115862 -0.014988 0.000871 0.132832 0.009000 0.132479 -0.028247 -0.135244 0.058978 0.054944 0.028600 -0.013175 -0.109775 0.022895 -0.317757 -0.044369 0.173422 0.145283 0.115316 0.067489 0.006463 -0.098150 0.043296 0.094722 -0.126330 -0.053972 0.160103 -0.322927 0.141243 -0.288537 0.288008 -0.064275 0.004527 0.141412 -0.267058 0.114012 -0.023515 0.015197 -0.004128 -0.011188 0.016101 0.136429 -0.048674 -0.125546 0.051939 0.038815 -0.223252 0.020734 0.113941 -0.012756 0.235244 0.208721 -0.213481 -0.283121 0.198124 0.067492
1716.lowfreq: -144.4227 -2.9950 -0.7077 -0.0021 0.0007 0.0010 2.5131 9.6757 10.3492
redmass: 2.2609 6.9174 7.0978 6.6958 6.3650 5.6251 5.0438 7.7423 7.0196 3.8652 2.3786 5.1876 2.4997 5.7460 3.0673 5.2601 6.7954 5.3668 6.1746 4.5596 6.9599 5.5396 4.5992 7.3126 6.6712 4.8843 7.3464 5.4495 5.9233 5.9869 6.1804 5.9064 8.6884 6.4913 6.5178 6.7233 6.7035 6.4615 6.2455 5.6011 4.5123 6.0845 3.0523 3.9863 4.7810 4.9252 3.4234 6.5055 4.5732 6.2564 3.7298 5.8204 5.3827 2.8667 4.9798 5.2337 5.5444 5.7337 8.2565 7.4191 6.6324 7.9565 6.8243 6.7807 3.2168 8.0363 6.7931 8.6021 5.2236 4.9537 4.1620 4.2741 3.4244 5.0298 6.3370 4.1037 3.9904 4.4085 4.2678 3.8846 3.7588 4.6392 4.6070 6.7141 5.8936 4.7966 3.0897 2.2758 3.4558 4.3633 4.0126 5.4778 3.4096 4.0881 6.9679 3.3247 7.1332 4.5297 4.8728 6.9415 6.6251 6.7052 6.8861 7.4839 4.8401 5.1591 1.7264 4.3798 4.3268 7.6159 6.5625 6.7665 5.0928 6.3476 3.7914 2.0197 1.9742 1.3582 3.7932 3.9433 3.4627 2.7350 2.7497 1.9757 4.4095 1.9673 2.0542 1.8569 1.6771 2.4528 4.5559 2.9899 1.3227 1.6796 1.7002 2.4857 2.4803 3.7302 4.5739 2.3567 1.5505 1.4985 3.0178 2.0731 1.3993 1.6193 1.4567 5.4851 1.6848 1.5687 1.4179 1.4296 3.3004 2.3224 2.3763 2.1700 4.9724 2.2616 2.2101 2.2595 3.1270 2.1373 1.4311 1.3805 1.4121 1.8427 1.4294 3.2163 1.3830 1.7731 1.4891 1.3765 2.5463 2.1730 1.8592 1.8642 2.3597 2.0356 1.4816 1.6442 1.6593 2.5838 2.4638 1.7996 1.5027 1.5275 1.1286 1.2636 1.1825 1.0743 1.0772 1.2264 1.1379 1.2378 1.6766 2.1377 2.5709 3.0081 1.1478 1.7828 1.3987 2.6056 2.5960 1.8489 2.0073 2.0576 1.5886 1.8810 1.7300 1.5709 1.7442 1.8450 1.7780 1.6717 2.3928 1.4019 3.5530 1.3137 1.3570 8.4682 8.5366 6.8152 6.9349 3.1426 1.3129 5.4041 3.6578 1.6180 4.8657 1.0497 2.3297 1.1856 1.4547 1.9864 1.0648 1.8493 1.1954 6.5068 4.1235 4.0657 1.8479 2.8031 1.8182 2.8140 4.8885 3.4526 3.3100 3.5436 4.2017 3.8486 3.8030 4.1851 5.2119 7.0379 7.0458 7.2590 7.1622 6.7133 7.8499 7.2406 8.9778 7.0057 6.9704 7.3205 8.6131 7.4334 11.8837 12.8568 12.8518 11.3277 11.7550 12.6803 12.7037 1.0749 1.0826 1.0646 1.0369 1.0366 1.0608 1.1012 1.1069 1.0887 1.1048 1.1026 1.1069 1.1071 1.0917 1.0913 1.0870 1.0869 1.0881 1.0931 1.0883 1.0927 1.0912 1.0908 1.0914 1.0909 1.0956 1.0955 1.0990 1.0932 1.0957 1.0975 1.1006 1.1004 1.0963 1.0907 1.0943 1.0979 1.0991 1.0790
irintensity: 3.1437 0.5086 0.2598 0.7914 0.0824 0.1045 0.5809 0.1619 0.1960 4.3269 1.4677 0.1988 0.5652 0.2112 0.3820 0.8655 0.7163 0.4582 0.7735 1.0651 5.1666 0.3397 2.1906 4.3916 2.4729 5.2275 0.5753 0.7041 0.8712 2.9142 1.0816 2.9040 22.8140 1.4023 7.3155 1.8251 2.0265 0.4781 0.1329 4.4739 0.8225 0.8831 5.8298 2.9269 3.1579 0.6355 0.3622 2.8933 2.2264 7.9969 0.9362 0.9338 0.3590 3.6585 1.9908 0.4805 0.1279 1.7336 12.0535 1.3597 3.2722 7.1641 7.1621 3.3188 17.0306 12.2178 9.4242 9.6119 3.3882 1.3202 3.0836 0.5273 9.3491 0.8703 1.3888 1.9094 14.2686 2.1512 5.2678 0.5839 0.7126 0.7377 5.6254 3.4746 3.3183 1.1645 4.8707 28.4211 2.5886 1.6877 1.5127 13.9338 8.6649 64.0490 0.3338 17.8333 1.4464 8.0955 6.4793 6.8606 0.7061 2.9527 9.3557 18.7677 9.3863 2.2578 6.8526 3.1692 2.3594 10.9689 3.1800 2.5405 35.4881 7.3556 9.6462 14.3120 16.0823 1.2846 4.6286 14.3603 3.9801 22.6651 12.9073 15.1187 4.1030 8.6297 47.7899 24.6609 0.4755 3.9503 5.1614 0.3694 51.6524 7.2717 25.6729 5.2708 9.1855 0.3368 10.0413 4.2270 2.2739 0.9150 10.7120 4.5062 0.7785 1.4707 2.0224 4.7047 12.1620 5.2157 1.7778 2.1127 11.6071 5.6788 2.8908 4.5675 4.3204 1.9848 8.8267 29.2407 26.6879 14.3505 0.3447 1.9968 2.0559 8.9631 1.9334 3.6557 0.1997 9.3275 2.2906 0.4822 4.0579 3.1179 4.7118 2.0663 11.7623 6.6813 8.8203 3.8459 2.8014 17.8728 7.2756 15.5932 4.2849 1.3793 2.0241 6.8227 2.3556 0.2450 3.3867 5.8513 2.5662 4.8924 2.5635 23.5151 14.1456 8.2509 4.5252 68.7211 2.1570 2.0416 3.5173 0.5603 10.6074 2.1206 8.1372 94.8525 57.7135 3.2605 2.1616 21.6512 0.1287 140.9737 2.0719 99.5690 2.5229 4.7422 2.5670 5.9966 24.7797 12.1164 5.3279 33.7894 106.3642 53.4488 33.2632 21.6272 402.5851 6.7334 7.8234 65.5571 350.6404 10.4345 25.5157 28.1526 33.5702 44.9703 56.2809 61.9907 199.5769 3.0882 458.9243 24.3688 101.4612 3.1156 96.5993 244.5376 0.4912 10.6658 16.6467 477.5199 20.1711 19.7672 42.8372 22.8433 16.3981 17.3902 21.7147 49.3112 0.6405 10.9733 29.7880 27.1597 76.7355 13.1473 331.2758 451.5014 534.2882 440.7715 90.3398 22.9391 72.3106 15.0149 1.3860 18.6729 18.2171 5.2456 20.3691 7.3004 6.3929 2.6663 13.3233 3.2000 14.6684 12.4821 0.1059 2.8477 1.4433 0.5616 6.1484 1.0342 0.8799 5.9694 0.7493 2.4987 0.2526 7.2245 3.2746 6.0912 5.0996 0.3936 2.0471 0.6574 4.0475 6.1959 1.0654 0.0390 4.5784 0.1153 0.2120 121.0593
temp: 353.000 k
press: 1.00000 atm
elementType: 6 6 6 6 6 1 1 1 7 6 6 8 8 7 6 6 6 1 46 6 1 6 6 6 6 1 6 6 1 1 6 6 6 1 7 6 6 6 6 6 1 6 1 6 6 1 6 1 1 1 7 46 7 8 6 8 6 1 1 7 6 1 6 8 1 1 1 1 6 6 6 6 1 6 1 6 6 1 1 6 6 6 1 6 6 6 1 1 7 1 1 6 1 6 6 1 1 8 8 6 1 1 6 1 1 1
symmnumber: 1
zpe: 2122836.9 jmol-1
zpe.correction: 0.808546 hartree
zpe.thermalcorrener: 0.889100 hartree
zpe.thermalcorrenthalpy: 0.890217 hartree
zpe.thermalcorrgfe: 0.677527 hartree
zpe.sumelectzpe: -3125.734701 hartree
zpe.sumelectthermal: -3125.654147 hartree
zpe.sumelectthermalent: -3125.653029 hartree
zpe.sumelectthermalfe: -3125.865720 hartree
dipole: 5.7477 4.0911 -0.5845
dipole: 7.0792
quadrupole: -447.4439 -392.4428 -411.6236
quadrupole: 18.6737 -19.3805 -1.7184
quadrupole: -30.2738 24.7273 5.5465 18.6737 -19.3805 -1.7184
hfenergy: -3126.5432467 hartree
pointgroup: C01 [X(C51H39N7O7Pd2)]
dipole: 2.2613306 1.6095514 -0.2299532 debye
polarizability: 891.6960883|21.2614521|694.3768441|-0.3474245|-82.509781|472.6237798 unknown
InChI: InChI=1S/C33H19N5O2.C14H14NO2.C4H6NO3.2Pd/c34-20-24-8-1-3-14-28(24)22-10-5-12-26(18-22)36-32(39)30-16-7-17-31(38-30)33(40)37-27-13-6-11-23(19-27)29-15-4-2-9-25(29)21-35;1-2-17-14(16)9-8-11-5-3-7-13-12(11)6-4-10-15-13;1-3(6)5-2-4(7)8;;/h1-19H;3-7,9-10H,2,8H2,1H3;5H,2H2,1H3;;/q-3;2*-1;+1;+4
charge 0 multiplicity 1
106 atoms
C  6.927627 0.144544 -0.895997
C  6.054886 2.322455 -0.575406
C  7.220896 2.900967 -1.068278
C  8.261302 2.050461 -1.46528
C  8.127022 0.658357 -1.380405
H  7.284549 3.988809 -1.123657
H  9.190013 2.479058 -1.84838
H  8.911784 -0.037546 -1.681386
N  5.967764 0.991923 -0.517873
C  6.561201 -1.327081 -0.774882
C  4.825915 3.061361 -0.071635
O  4.753193 4.277994 -0.166569
O  7.375407 -2.194396 -1.049705
N  3.921934 2.201934 0.481992
C  2.721575 2.664227 1.051562
C  1.07055 2.43169 2.826067
C  0.630913 3.913326 0.963199
H  0.770114 1.997354 3.782235
Pd 4.336705 0.232517 0.17731
C  0.220551 3.320344 2.167206
H  -0.740646 3.589817 2.611143
C  -0.232509 4.913368 0.288319
C  0.31397 6.122418 -0.164207
C  -1.616823 4.705514 0.080289
C  -0.480098 7.094591 -0.770298
H  1.380954 6.30007 -0.009871
C  -2.419546 5.688029 -0.527212
C  -1.851279 6.885245 -0.946486
H  -0.025147 8.030399 -1.101736
H  -2.472694 7.648987 -1.416826
C  1.881168 3.589166 0.415198
C  -2.229621 3.446366 0.395926
C  2.312109 2.118867 2.28054
H  2.995598 1.438818 2.794158
N  5.261454 -1.47723 -0.39036
C  1.440811 -0.535542 0.334733
C  2.774403 -1.287876 2.099994
C  1.350946 0.133125 -0.915299
C  0.289264 -1.157766 0.896184
C  1.68246 -1.904956 2.733094
H  3.781783 -1.345934 2.522771
C  0.169208 0.102714 -1.611388
H  2.24035 0.636756 -1.30387
C  -0.9517 -1.125876 0.176131
C  0.441131 -1.819963 2.140819
H  1.830511 -2.454555 3.66232
C  -0.976182 -0.540188 -1.075828
H  0.097654 0.586214 -2.587573
H  -0.411015 -2.308434 2.615321
H  -1.895681 -0.538184 -1.664297
N  2.650637 -0.612267 0.967395
Pd -3.350906 0.428249 0.355859
N  -2.750611 2.427177 0.580714
O  -4.833967 0.764316 -0.985225
C  -5.980188 0.702406 -0.397787
O  -6.15645 0.594391 0.814473
C  -7.161351 0.734429 -1.353165
H  -7.087741 1.612287 -2.015076
H  -7.078288 -0.147555 -2.012104
N  -8.38689 0.729843 -0.601536
C  -9.595151 0.834303 -1.215651
H  -8.274258 0.693803 0.410819
C  -10.798467 0.843468 -0.295832
O  -9.700816 0.913977 -2.429064
H  -10.53722 0.749114 0.766522
H  -11.353384 1.778444 -0.453714
H  -11.465316 0.019297 -0.58368
H  -3.482328 5.490156 -0.678047
C  4.636626 -2.737111 -0.307972
C  3.350418 -2.854738 -0.853507
C  5.180921 -3.836425 0.37143
C  2.553089 -3.98438 -0.641345
H  2.9533 -1.999431 -1.406013
C  4.40865 -4.986944 0.55044
H  6.19792 -3.773474 0.761188
C  3.097641 -5.062046 0.077427
C  1.173551 -4.00487 -1.195701
H  4.834543 -5.840082 1.083115
H  2.508518 -5.966382 0.243409
C  0.936105 -3.53251 -2.496411
C  0.05408 -4.458697 -0.458068
C  -0.342128 -3.524991 -3.052202
H  1.787705 -3.187538 -3.087221
C  -1.233731 -4.461103 -1.023829
C  0.166128 -4.850364 0.923269
C  -1.434858 -3.995653 -2.31901
H  -0.48451 -3.158965 -4.071331
H  -2.074129 -4.818265 -0.42406
N  0.191162 -5.125155 2.052039
H  -2.436663 -4.000085 -2.753187
H  2.202464 4.037822 -0.526633
C  -3.474093 -1.53499 0.059127
H  -3.455465 -1.778263 -1.010017
C  -2.204973 -1.647911 0.850146
C  -4.681432 -2.036221 0.769795
H  -2.378608 -1.030431 1.781582
H  -2.07184 -2.653027 1.293566
O  -4.716927 -2.252819 1.962985
O  -5.722111 -2.188265 -0.053718
C  -6.990954 -2.433118 0.561223
H  -7.734502 -2.049554 -0.151876
H  -7.045369 -1.83102 1.479828
C  -7.189148 -3.906398 0.848737
H  -8.190297 -4.079106 1.26944
H  -7.094847 -4.502249 -0.070638
H  -6.444626 -4.251699 1.579331
