program: Gaussian 16
title: taken from G01 mpaa calculations. Just changing temperature.
version: ES64L-G16RevA.03
frameworkgroup: C1[X(C2H4O2)]
method: RMN15
basis: def2SVP
operation: Freq
keyword: #N
keyword: Geom=AllCheck
keyword: Guess=TCheck
keyword: SCRF=Check
keyword: GenChk
keyword: RMN15/def2SVP
keyword: Freq
converged: YES YES YES YES
title: Mulliken charges:
elementType: C O C H H H O H
charge: 0.047734 -0.213869 0.014574 0.053548 0.053513 0.047016 -0.194839 0.192324
chargesum: 0.00000
title: Mulliken charges with hydrogens summed into heavy atoms:
elementType: C O C O
charge: 0.047734 -0.213869 0.168650 -0.002516
chargesum: -0.00000
1716.lowfreq: -9.7693 -6.3716 0.0003 0.0007 0.0016 7.2947 86.1745 411.5829 537.9001
frequency: 86.1721 411.5828 537.8999 589.3114 678.3395 891.9293 983.4013 1043.2722 1207.8892 1323.1076 1413.7105 1427.2007 1434.7544 1916.8292 3100.8470 3193.4743 3242.6796 3820.8035
redmass: 1.0877 2.7259 1.5390 3.8594 1.4192 2.9280 1.5805 1.9522 1.6995 1.3857 1.1819 1.0453 2.5801 10.6187 1.0374 1.1022 1.1074 1.0642
irintensity: 0.8939 3.6753 22.6832 51.7405 102.5637 5.0153 26.6137 13.6792 173.4165 18.1018 46.7419 10.6068 136.8962 328.2603 0.5652 2.0744 2.1465 83.1482
temp: 353.000 k
press: 1.00000 atm
elementType: 6 8 6 1 1 1 8 1
symmnumber: 1
zpe: 163309.4 jmol-1
zpe.correction: 0.062201 hartree
zpe.thermalcorrener: 0.068094 hartree
zpe.thermalcorrenthalpy: 0.069212 hartree
zpe.thermalcorrgfe: 0.029034 hartree
zpe.sumelectzpe: -228.582332 hartree
zpe.sumelectthermal: -228.576439 hartree
zpe.sumelectthermalent: -228.575321 hartree
zpe.sumelectthermalfe: -228.615499 hartree
dipole: -0.5370 -1.5551 0.0002
dipole: 1.6452
quadrupole: -18.8354 -27.8836 -22.7150
quadrupole: -2.1805 -0.0003 0.0004
quadrupole: 4.3093 -4.7390 0.4297 -2.1805 -0.0003 0.0004
hfenergy: -228.644533 hartree
pointgroup: C01[X(C2H4O2)]
dipole: -0.2109295 -0.6119541 0.0000815 debye
dipolederiv: 1.4590866 -0.0596494 -0.0000144 -0.1539989 1.762149 0.0001395 -0.0001036 0.0001405 0.2872089 -0.7937162 -0.3309062 -0.0000189 -0.0848784 -1.0586781 -0.0000946 0.0000843 0.0001551 -0.3509374 -0.3202184 -0.0784396 -0.0000069 -0.1036928 -0.0324512 -0.0000462 -0.0001481 -0.0000667 0.0045286 0.0514095 -0.0022184 0.0015691 -0.0086686 0.0584145 -0.073981 -0.0333239 -0.0657243 0.0081569 0.0514241 -0.00224 -0.0015374 -0.0087222 0.0584195 0.0739965 0.0333662 0.0657355 0.0080942 0.0336493 0.0182933 -0.0000027 0.0648336 -0.0190995 0.0000124 -0.0000267 0.0000051 0.0889326 -0.7757094 0.5108727 0.000018 0.4009616 -1.0419942 -0.0000396 0.0001329 -0.0002411 -0.388159 0.2940745 -0.0557123 -0.0000068 -0.1058343 0.27324 0.000013 0.0000189 -0.0000039 0.3421754 unknown
polarizability: 30.749441|0.9204876|29.3538778|-0.0014179|-0.0006216|19.4833515 unknown
InChI: InChI=1S/C2H4O2/c1-2(3)4/h3H,1H3
charge 0 multiplicity 1
8 atoms
C  0.0898733 0.12170748 0.0002712
O  0.63656838 1.19581497 -0.00003498
C  -1.39273549 -0.11229741 0.00002792
H  -1.67259083 -0.70157422 -0.88429722
H  -1.67285994 -0.70140686 0.88437726
H  -1.91656026 0.84860517 -0.00014333
O  0.77902773 -1.03283227 -0.00003467
H  1.72310912 -0.79626586 -0.00017917
