program: Gaussian 16
title: int-3after an IRC (120 steps)
version: ES64L-G16RevA.03
method: RMN15
basis: Gen
operation: Freq
keyword: #NGeom=AllCheck
keyword: Guess=TCheck
keyword: SCRF=Check
keyword: GenChk
keyword: RMN15/ChkBas
keyword: Freq
title: int-3 after an IRC (120 steps)
converged: YES YES NO NO
title: Mulliken charges:
elementType: C C C C C H H H N C C O O N C C C H C C C C H Pd C H C H C C C C H C C H H C C H H H C C H C H C H H H C C C C H C C H H C N N C C C C C H C H C C H C H H H H N Pd N O C O N C H H C C H H H O H H
charge: 0.079862 0.078397 -0.004474 0.088925 -0.004719 0.015385 0.015691 0.016743 -0.162497 0.148406 0.140228 -0.226589 -0.224188 -0.316592 0.053817 0.018600 -0.061580 -0.016574 0.042198 -0.043653 0.011467 -0.071066 -0.022073 0.113162 0.042079 -0.021862 0.039975 -0.035624 0.070445 -0.022418 -0.132340 0.050337 0.004109 0.045622 0.024823 0.005928 0.003395 -0.048402 0.153517 0.024735 0.003100 0.049115 -0.103795 0.062115 -0.022795 0.034224 -0.013400 0.168201 0.040569 0.002752 0.003994 0.038383 -0.019563 -0.119715 0.046042 -0.007842 0.041974 0.024542 -0.000143 -0.002449 -0.157234 0.093146 -0.331037 0.026668 0.118236 0.063271 0.081393 0.040882 0.042078 0.035992 0.010774 -0.131264 0.082541 0.004374 -0.030751 -0.013120 0.219718 0.011270 -0.007494 -0.132715 0.025037 0.207027 -0.336895 0.186999 -0.257203 -0.247295 0.070846 0.057868 0.034636 0.043890 0.043930 0.054450 0.062220 0.075838 -0.141317 0.003100 -0.008367
chargesum: -0.00000
title: Mulliken charges with hydrogens summed into heavy atoms:
elementType: C C C C C N C C O O N C C C C C C C Pd C C C C C C C C C C C C C C C C C C C C C N N C C C C C C C C C N Pd N O C O N C C C O
charge: 0.079862 0.078397 0.010911 0.104617 0.012023 -0.162497 0.148406 0.140228 -0.226589 -0.224188 -0.316592 0.053817 0.002025 -0.061580 0.042198 -0.043653 -0.010606 -0.071066 0.113162 0.020218 0.004351 0.070445 -0.018308 -0.132340 0.056265 0.048722 0.028219 -0.048402 0.230467 -0.103795 0.039320 0.020824 0.215516 0.038383 -0.027405 -0.119715 0.045899 0.033606 0.022093 -0.157234 0.093146 -0.331037 0.026668 0.160314 0.074045 0.081393 0.045256 0.022872 -0.131264 0.093811 -0.038245 -0.132715 0.025037 0.207027 -0.336895 0.186999 -0.257203 -0.247295 0.163351 0.043890 0.236437 0.078401
1716.lowfreq: -3.5309 -0.4148 -0.0011 -0.0004 0.0009 2.7123 11.2485 17.6202 22.8738
redmass: 6.6002 7.1027 7.4356 6.0748 7.6197 5.8656 7.4071 6.2765 6.1004 4.4353 5.8624 4.9701 5.1594 6.3620 6.5164 6.1699 5.4068 6.6287 6.7581 5.9987 5.5512 5.4555 6.1650 5.5884 4.4612 4.5980 4.9471 1.4322 3.8352 4.8104 5.9093 3.8915 6.5783 4.5151 4.6564 4.0134 5.4867 5.5291 2.5077 3.0884 4.4527 5.1379 5.6524 1.4483 4.7752 4.9315 3.8436 5.0702 4.3332 5.5189 5.2077 5.7450 6.6671 5.2532 4.3109 5.1867 7.6867 5.8679 5.6718 4.8408 5.1322 5.4863 6.3979 8.0548 4.0930 4.4273 6.8796 7.8480 4.7438 4.7884 4.3969 3.7779 4.6586 5.5750 4.3051 4.9348 6.6319 3.5179 4.3150 5.0138 3.0563 6.8773 5.5220 6.8533 6.7777 3.0379 3.9282 3.2780 5.2047 2.4479 6.5185 6.6653 4.4360 4.9894 6.8930 7.2630 5.7085 5.4614 4.2425 5.3810 6.2709 6.5374 6.4956 7.6009 6.4715 1.2533 2.0922 2.2699 6.6067 2.3780 1.9308 2.4723 2.9051 4.5638 1.9354 2.0202 1.5419 2.6040 3.9234 5.1034 4.5114 4.4894 1.9406 3.4380 1.9310 1.8358 2.8752 2.4474 4.0046 3.2713 3.3216 1.4706 1.4604 1.5755 1.4425 4.7533 1.5477 2.2201 2.3431 1.4493 6.3540 1.4462 1.9497 2.2679 2.8481 1.4469 1.3950 1.4970 1.5927 1.6325 1.4141 1.5448 1.7437 1.7484 1.7416 1.3704 1.3775 1.3819 1.3734 1.9514 1.9210 2.1846 1.8271 1.7625 2.0016 1.7647 3.4961 2.0023 1.1333 1.2702 1.4221 1.3693 2.4316 1.1886 1.0725 1.0760 1.7323 1.9461 1.8912 2.3719 1.1705 1.6907 2.4473 2.5471 2.5419 2.2001 1.9511 1.8222 2.0095 1.4861 1.7799 1.6580 2.1992 1.6655 2.7492 3.7377 5.9388 4.7770 3.3639 1.3673 7.5144 4.2335 1.8261 1.5566 4.3107 4.0550 2.5648 3.7375 1.1085 1.2176 2.0638 1.1163 1.3335 5.0653 1.0632 1.1264 6.2414 1.1366 2.6985 2.8292 4.4657 3.3453 3.2979 3.0236 4.3107 4.9083 4.2364 4.3079 4.0214 4.0994 4.9631 7.0369 7.6047 7.2512 7.6038 7.5172 6.9575 7.4475 7.7565 8.8871 7.1494 7.7775 7.1945 8.6509 9.6969 12.5713 12.5405 12.7024 12.6806 12.7212 1.0420 1.0369 1.0656 1.0390 1.0995 1.1010 1.1001 1.1052 1.1021 1.1018 1.0893 1.0901 1.0886 1.0877 1.0928 1.0928 1.0918 1.0875 1.0937 1.1060 1.0876 1.0983 1.0912 1.0909 1.0989 1.0912 1.0988 1.0959 1.0965 1.1003 1.1004 1.0942 1.0978 1.0968 1.0644
irintensity: 0.2992 0.1309 1.0621 1.2437 0.7208 2.3302 1.0665 0.2345 0.8643 7.0660 1.3902 0.0337 1.1136 0.6194 0.0494 1.3029 0.5295 2.4159 2.1791 0.6003 2.1745 1.2148 1.3315 0.4274 4.0229 0.0382 4.2778 0.0832 0.3028 1.7979 0.7164 4.3782 0.5774 1.6358 0.2296 1.8161 1.1422 2.5305 1.0491 1.7635 3.0544 3.0812 0.3475 0.2729 1.3390 2.2289 4.3411 1.0772 1.9889 8.0613 1.1554 12.0755 8.4350 3.2077 2.7881 0.6629 20.2570 8.2886 1.9980 0.8946 6.3717 11.6430 15.8636 31.2517 1.9843 1.2530 12.8112 0.3901 5.4732 2.8144 4.6250 1.2529 3.3687 2.3793 1.6532 1.7797 0.0680 1.9289 1.2039 4.1018 0.1753 0.8528 6.2548 2.2770 3.9080 18.8298 2.9239 4.9151 4.2819 1.3503 5.2643 1.8894 2.3932 5.0598 24.9767 10.9506 2.5054 0.5734 9.5620 2.3459 4.4905 4.1638 7.8227 11.0409 0.8911 115.3240 20.0252 5.0058 42.8520 2.1132 13.1713 12.8118 16.8382 1.8304 31.7806 11.9324 23.9814 8.8427 2.6035 0.5257 0.7878 1.0577 21.9403 13.1858 55.7155 6.3830 2.0161 10.3346 12.4131 7.1748 3.3276 0.0553 0.2135 3.9787 4.7526 52.2693 2.7320 9.1022 2.4802 0.0365 5.2026 6.6713 14.8349 11.9994 30.9735 2.6230 0.8918 1.4780 7.8002 1.7886 3.0351 5.6182 2.8058 5.1956 8.6958 0.2233 0.0914 0.2365 0.5265 2.0063 0.8047 3.3122 1.1935 4.5211 15.6605 1.4381 19.3255 9.4006 0.7149 6.1609 11.8135 3.4468 42.2306 2.6822 1.1321 1.9235 26.6726 3.6516 3.2388 11.6861 4.1337 2.5352 2.6502 0.7883 4.8985 5.6220 5.1190 20.8539 4.6757 48.1123 3.3841 0.9175 0.1943 24.7754 1.9009 0.4127 9.1866 1.6693 6.8072 4.9316 6.1920 18.4790 21.3104 21.9627 282.3305 67.5280 3.7210 27.5800 27.1964 32.5501 23.7234 6.1721 102.9174 261.6963 7.4952 1.1659 18.0789 11.8563 19.6295 21.1368 54.6125 2.3910 20.1964 66.1572 56.4910 244.8401 52.5593 0.9822 14.9429 4.3829 40.3547 20.6527 60.6258 4.2501 14.0596 30.5906 28.5989 8.0503 6.5322 2.7098 14.5379 37.7012 12.1848 57.1146 244.2300 510.3290 421.9592 1078.4455 57.2292 70.8252 8.4264 10.1828 11.2084 0.1437 7.2194 5.9012 11.6081 8.6691 0.8604 13.4312 4.0332 1.3263 1.6960 0.1629 11.1571 6.4295 1.3290 1.0792 2.6046 0.7724 1.0684 7.8966 1.2944 7.7628 11.3817 0.6989 5.3163 5.3363 2.2670 10.0384 7.1491 4.0863 0.0388 3.0337 505.2742
temp: 353.000 k
press: 1.00000 atm
elementType: 6 6 6 6 6 1 1 1 7 6 6 8 8 7 6 6 6 1 6 6 6 6 1 46 6 1 6 1 6 6 6 6 1 6 6 1 1 6 6 1 1 1 6 6 1 6 1 6 1 1 1 6 6 6 6 1 6 6 1 1 6 7 7 6 6 6 6 6 1 6 1 6 6 1 6 1 1 1 1 7 46 7 8 6 8 7 6 1 1 6 6 1 1 1 8 1 1
symmnumber: 1
zpe: 1938934.9 jmol-1
zpe.correction: 0.738501 hartree
zpe.thermalcorrener: 0.811475 hartree
zpe.thermalcorrenthalpy: 0.812593 hartree
zpe.thermalcorrgfe: 0.621421 hartree
zpe.sumelectzpe: -2859.153030 hartree
zpe.sumelectthermal: -2859.080057 hartree
zpe.sumelectthermalent: -2859.078939 hartree
zpe.sumelectthermalfe: -2859.270111 hartree
dipole: 4.3225 2.5862 -3.4018
dipole: 6.0782
quadrupole: -382.6605 -350.3272 -381.6337
quadrupole: -70.0039 30.7825 6.8516
quadrupole: -11.1201 21.2133 -10.0932 -70.0039 30.7825 6.8516
hfenergy: -2859.8915316 hartree
pointgroup: C01[X(C48H35N7O5Pd2)]
dipole: 1.7567107 0.8634304 -1.3737096 debye
polarizability: 785.1106105|-41.8031964|748.0834165|-9.0538575|-39.7269377|433.9936379 unknown
InChI: InChI=1S/C35H23N5O2.C9H6N.C4H6NO3.2Pd/c1-22-26(28-12-5-3-10-24(28)20-36)14-7-16-30(22)39-34(41)32-18-9-19-33(38-32)35(42)40-31-17-8-15-27(23(31)2)29-13-6-4-11-25(29)21-37;1-2-6-9-8(4-1)5-3-7-10-9;1-3(6)5-2-4(7)8;;/h3-19H,1-2H3;1-3,5-7H;6H,2H2,1H3;;/q-3;-1;-2;+2;+4
charge 0 multiplicity 1
97 atoms
C  4.30208222 3.27634991 -0.84035641
C  2.43645138 4.52306442 -0.09564633
C  3.14184697 5.71709945 -0.21459337
C  4.46869755 5.65793998 -0.65978048
C  5.06616044 4.43132087 -0.97734185
H  2.63939758 6.64949979 0.04749789
H  5.04529408 6.58022785 -0.75955633
H  6.09597932 4.33890994 -1.32598521
N  3.04340122 3.37674579 -0.40934703
C  4.75313188 1.85877804 -1.14130827
C  1.01147572 4.37093669 0.40457777
O  0.37577881 5.35416229 0.76282008
O  5.90218117 1.63910587 -1.50203494
N  0.62365131 3.06632836 0.42665522
C  -0.60988122 2.69827041 1.00698157
C  -1.74291791 1.32979985 2.6707943
C  -3.02985107 2.68021789 1.1169068
H  -1.69934726 0.63460189 3.51165772
C  3.94803419 -0.41747954 -1.16958896
C  4.75919747 -1.16762484 -0.29043298
C  3.38244523 -2.41525664 -2.42544922
C  4.87099207 -2.55609828 -0.51177953
H  2.84663208 -2.89738003 -3.24566487
Pd 2.01447443 1.74677533 -0.26869135
C  -2.97126629 1.77238225 2.18549101
H  -3.89871322 1.44012663 2.65931599
C  4.19925667 -3.16527559 -1.58168927
H  4.30776509 -4.24287164 -1.72922323
C  -4.37005206 3.19033404 0.71776423
C  -4.6394044 4.56629658 0.71262784
C  -5.44134321 2.32240594 0.39904625
C  -5.91187876 5.05473599 0.42201136
H  -3.82962761 5.25469166 0.96431172
C  -6.72840737 2.81048264 0.1106967
C  -6.96270237 4.17988053 0.12538879
H  -6.09002491 6.13215083 0.43693053
H  -7.95893953 4.56633241 -0.09560181
C  -1.84861679 3.1392923 0.49078575
C  5.46102212 -0.45383643 0.8302129
H  4.73564263 0.11885288 1.43297563
H  6.0043667 -1.13707599 1.49409842
H  6.17872304 0.26911262 0.41367793
C  -5.19119047 0.91531053 0.30185058
C  3.25477174 -1.04612734 -2.21130294
H  2.61178771 -0.42905656 -2.84508068
C  -0.5731203 1.80764209 2.09100199
H  0.40755467 1.49980527 2.46375647
C  -1.8763343 4.02622619 -0.72172475
H  -1.7408468 5.08254936 -0.4436034
H  -1.03195066 3.77069489 -1.38034191
H  -2.81126287 3.91534628 -1.28872933
C  5.69336623 -3.43364731 0.36957063
C  6.83228432 -4.07443403 -0.131857
C  5.32856571 -3.69288263 1.70935077
C  7.59426176 -4.92633755 0.66905178
H  7.12179004 -3.88497455 -1.16807663
C  6.09509602 -4.54706196 2.51767614
C  7.23017363 -5.16180798 1.99682113
H  8.48236893 -5.40739546 0.25359889
H  7.82738982 -5.82572443 2.62435241
C  4.14015124 -3.08820633 2.25192725
N  3.18147242 -2.61030598 2.70034912
N  3.74442139 0.9654544 -0.96145601
C  -0.33195763 -0.00920776 -0.74891722
C  1.17249848 -0.8068929 0.85566556
C  -0.57832558 0.85016708 -1.84837775
C  -1.3369491 -0.92429106 -0.31608534
C  0.25918627 -1.78268016 1.3032435
H  2.16335858 -0.72296884 1.31337834
C  -1.8031013 0.81436694 -2.47295655
H  0.21795167 1.5244442 -2.17505395
C  -2.62775324 -0.91754213 -0.94241124
C  -0.99960888 -1.80805719 0.74496154
H  0.57235762 -2.46005155 2.09762057
C  -2.82550758 -0.05109805 -2.00933825
H  -1.99780865 1.46986675 -3.32544179
H  -2.44933071 -2.51361453 -2.18413768
H  -1.76156737 -2.50928562 1.09697257
H  -3.80068414 -0.02038236 -2.50524787
N  0.87425125 0.06122287 -0.09744218
Pd -4.16139886 -1.98630002 -0.20605397
N  -4.94373535 -0.20767651 0.17486613
O  -5.6991833 -3.03580307 0.6002432
C  -5.45885653 -4.2815339 0.85586144
O  -6.18806386 -5.06783489 1.42300067
N  -3.44811209 -3.84112102 -0.53643578
C  -4.06645646 -4.77277819 0.40290764
H  -3.44330861 -4.86590037 1.30978363
H  -4.18818376 -5.77990102 -0.01980342
C  -2.67295906 -4.25819706 -1.48058697
C  -2.27692505 -5.68937983 -1.67445218
H  -1.50287235 -5.74641811 -2.44698712
H  -1.90288507 -6.12100131 -0.73638946
H  -3.14670743 -6.28333011 -1.99282133
O  -2.16543241 -3.43840647 -2.37668376
H  -7.52713961 2.10670521 -0.13027885
H  5.78606849 -4.72586886 3.54913142
