program: Gaussian 09
title: 000000713
version: EM64L-G09RevD.01
frameworkgroup: C1[X(CH3NO)]
method: RPBEPBE
basis: SDD
operation: Freq
keyword: #pfreq=noraman
keyword: PBEPBE/SDD
title: #p freq=noraman PBEPBE/SDD
converged: NO NO NO NO
title: Mulliken charges:
elementType: O N C H H H
charge: -0.244579 -0.554038 -0.016026 0.332969 0.316804 0.164870
chargesum: 0.00000
title: Mulliken charges with hydrogens summed into heavy atoms:
elementType: O N C
charge: -0.244579 0.095735 0.148844
polarizability: 3.12813876e+01 -1.09583616e+00 2.10894446e+01 1.99629808e-04 1.01552961e-04 9.83160077e+00
1716.lowfreq: -4.1436 0.0004 0.0005 0.0007 16.6928 57.0219 523.4285 531.3930 656.3655
frequency: 523.4267 531.3908 656.3613 995.4297 1021.2554 1239.5110 1377.4491 1596.1284 1675.9459 2918.7092 3505.1542 3662.8955
redmass: 1.1526 2.6032 1.3007 1.5049 1.7674 3.2338 1.2136 1.2622 4.3269 1.0870 1.0451 1.1043
irintensity: 226.9456 8.8922 147.1139 7.8481 3.1156 83.4223 19.1510 30.2746 357.2884 111.5141 24.2053 24.6733
temp: 298.150 k
press: 1.00000 atm
elementType: 8 7 6 1 1 1
symmnumber: 1
zpe: 117854.0 jmol-1
zpe.correction: 0.044888 hartree
zpe.thermalcorrener: 0.048361 hartree
zpe.thermalcorrenthalpy: 0.049305 hartree
zpe.thermalcorrgfe: 0.020569 hartree
zpe.sumelectzpe: -169.639852 hartree
zpe.sumelectthermal: -169.636379 hartree
zpe.sumelectthermalent: -169.635435 hartree
zpe.sumelectthermalfe: -169.664170 hartree
dipole: -4.2535 0.9088 0.0002
dipole: 4.3495
quadrupole: -17.9611 -14.9880 -19.0645
quadrupole: 1.2719 -0.0008 0.0004
quadrupole: -0.6232 2.3499 -1.7267 1.2719 -0.0008 0.0004
hfenergy: -169.6847399 hartree
pointgroup: C01 [X(C1H3N1O1)]
dipole: -1.676648 -0.3422506 -0.0000776 debye
dipolederiv: -1.0765056 -0.0382989 -0.00012 -0.3312028 -0.529135 -0.0000672 0.0001501 0.0000379 -0.3863069 -1.0298719 0.1989635 0.0001 0.4450057 -0.3061357 0.0000007 -0.0000052 -0.0000054 -0.7705933 1.7714515 -0.036847 0.0001041 -0.0400598 0.8124189 0.0001401 -0.0000029 0.0001232 0.1964419 0.1745622 -0.0030655 -0.0000314 -0.0040551 0.1420885 -0.0000052 -0.0000492 0.0000244 0.4107211 0.1395418 -0.0218477 -0.0000361 -0.0301964 0.1556773 -0.0000059 -0.000068 -0.0000013 0.4177377 0.020822 -0.0989044 -0.0000166 -0.0394916 -0.274914 -0.0000625 -0.0000248 -0.0001788 0.1319994 unknown
polarizability: 31.3005606|1.0025363|21.0702716|-0.0001987|0.0001034|9.8316008 unknown
InChI: InChI=1S/CH3NO/c2-1-3/h1H,2H2
charge 0 multiplicity 1
6 atoms
O  1.139083 0.24037 -0.00005
N  -1.201238 0.179464 0.000048
C  0.055943 -0.399491 0.000197
H  -1.28793 1.196878 0.000025
H  -2.046434 -0.390516 -0.000105
H  0.000176 -1.514705 -0.000216
