program: Gaussian 16
title: Title Card Required
version: ES64L-G16RevA.03
method: RMN15
basis: Gen
operation: Freq
keyword: #N
keyword: Geom=AllCheck
keyword: Guess=TCheck
keyword: SCRF=Check
keyword: GenChk
keyword: RMN15/ChkBas
keyword: Freq
converged: YES YES NO YES
title: Mulliken charges:
elementType: C C C C C H H H N C C O O N N C C C H C C C C H Pd C H C H C C C H C C H H C C H H H C H C H C H H H C C C H C C H H C C C C N N N C C C C C H C H C C H C H H H H H H
charge: 0.074749 0.077037 -0.003106 0.090013 -0.002537 0.020733 0.017599 0.020594 -0.162170 0.141041 0.144753 -0.204656 -0.204706 -0.324236 -0.326723 0.033006 0.005120 -0.058166 -0.023117 0.029527 -0.036613 0.005446 -0.042662 -0.027921 0.119780 0.027692 -0.033557 0.022133 -0.035183 0.064739 -0.031683 0.048345 -0.039171 0.039542 0.023223 -0.007658 -0.003721 -0.058943 0.152274 0.060078 0.012012 0.003314 0.054380 -0.019468 0.056520 -0.016064 0.157948 0.013102 0.006539 0.059719 0.055614 -0.026370 0.050663 -0.045087 0.039143 0.022857 -0.010439 -0.004953 -0.116121 -0.119558 -0.190121 -0.191869 0.127057 0.124472 -0.130523 0.029612 0.128249 0.123528 0.082489 0.051017 0.049899 0.010483 -0.008813 -0.028536 0.040373 0.002140 0.062181 -0.004813 -0.021162 -0.004635 -0.003404 -0.006568 -0.005697
chargesum: -0.00000
title: Mulliken charges with hydrogens summed into heavy atoms:
elementType: C C C C C N C C O O N N C C C C C C C Pd C C C C C C C C C C C C C C C C C C C C C N N N C C C C C C C C C
charge: 0.074749 0.077037 0.017626 0.107612 0.018057 -0.162170 0.141041 0.144753 -0.204656 -0.204706 -0.324236 -0.326723 0.033006 -0.017997 -0.058166 0.029527 -0.036613 -0.022475 -0.042662 0.119780 -0.005865 -0.013050 0.064739 -0.070855 0.040687 0.033845 0.019502 -0.058943 0.227678 0.034912 0.040455 0.237307 0.055614 -0.071456 0.040224 0.032575 0.017904 -0.116121 -0.119558 -0.190121 -0.191869 0.127057 0.124472 -0.130523 0.029612 0.178148 0.114714 0.082489 0.053157 0.005669 -0.049698 0.035738 0.058777
chargesum: 0.00000
1716.lowfreq: -7.9679 -3.1598 -0.0005 0.0006 0.0008 3.7367 5.5495 13.2047 17.5823
frequency: 5.2210 13.1761 17.3988 21.7466 28.4658 33.6949 34.8413 46.0366 51.0930 60.9294 64.9415 68.0395 78.1179 82.1419 93.2520 102.4083 117.3606 120.9209 129.6460 140.4805 145.7685 150.1640 151.9987 161.1645 166.9339 179.7014 186.2783 195.2247 197.7767 205.7295 222.0669 225.6581 246.6955 255.5344 259.2277 265.6024 267.3456 281.7826 287.8148 291.5426 300.1322 302.6941 305.3228 340.1449 352.3638 360.9022 375.2817 392.8225 394.4437 400.7802 402.9894 403.3019 428.3570 431.3949 458.7696 462.0406 477.4964 479.3190 480.4147 484.6465 508.7679 518.1251 522.5919 526.2682 527.0247 532.0251 533.5109 554.6002 557.9605 565.4872 569.6153 588.6930 590.5128 599.3136 599.5858 618.4203 619.4106 636.6008 637.9270 642.2635 647.6761 683.1127 695.5385 697.2653 708.3129 740.1873 742.8245 761.7924 762.3212 773.1501 785.7763 788.1289 789.2591 790.0050 791.4873 795.9698 797.2014 804.1532 811.7935 812.9351 813.8573 815.4398 822.8300 829.8262 832.8002 867.1358 875.1882 907.5402 913.2042 919.3520 920.9684 939.2743 943.4345 956.6390 970.6455 977.0958 983.7188 994.2054 996.1011 1000.7685 1003.2799 1004.7738 1007.4207 1019.8893 1023.4258 1030.1047 1031.1054 1033.4082 1042.9549 1045.9140 1046.4668 1047.1890 1047.8738 1054.5170 1068.8049 1069.5171 1084.2337 1094.2105 1094.4670 1098.0952 1098.9633 1107.7624 1129.1966 1131.7008 1133.4176 1133.7345 1144.4916 1148.2478 1154.8516 1154.8627 1165.1398 1167.6880 1200.4195 1202.2630 1216.7553 1217.4861 1223.5023 1223.7444 1238.8969 1254.9107 1258.1958 1267.3616 1268.7394 1269.6344 1283.8371 1305.2565 1325.3042 1349.1715 1351.0441 1357.9453 1360.7809 1369.1519 1371.5947 1377.8496 1381.0637 1406.7663 1407.6875 1419.0028 1421.0363 1428.6140 1435.9289 1436.4518 1446.4915 1469.4624 1469.5139 1475.8119 1479.8122 1497.1513 1501.8661 1504.7722 1505.1729 1507.3686 1525.4141 1537.9632 1538.8966 1574.0968 1648.1573 1648.2850 1656.6301 1657.9525 1667.7912 1669.3809 1669.9568 1674.0869 1680.3933 1682.9267 1683.5501 1691.0625 1709.4340 1808.7000 1817.0221 2401.9314 2402.5057 3058.5489 3061.6367 3145.5195 3147.5740 3180.4163 3188.0832 3215.8604 3215.9360 3219.0846 3222.5160 3223.3469 3224.0878 3224.7316 3228.2908 3231.3151 3234.6900 3235.8626 3236.1109 3237.0025 3241.8358 3242.8561 3243.2240 3244.8667 3245.6097 3248.0303 3256.3154 3256.7280 3264.0741 3266.0873 3268.4353
redmass: 7.2264 6.9167 6.5056 6.5116 7.5137 6.8809 5.8686 6.3700 6.4331 6.1422 5.6864 5.6264 7.7923 6.2959 5.1389 5.5052 6.1423 7.5373 5.9266 5.5928 5.3200 6.2862 5.3072 6.6328 6.2205 4.7023 5.3661 4.9406 4.6861 4.6350 6.5900 5.3851 4.9326 3.2170 1.4859 1.8375 2.0479 5.3977 5.1289 4.9520 4.8630 5.0096 4.0916 8.5990 5.2944 5.8570 3.6553 7.7763 3.8695 4.2700 4.2262 4.0376 3.7132 8.5496 4.5331 4.3953 5.8065 4.8668 5.3896 3.2740 4.9900 7.0383 3.5821 3.5083 3.7789 6.1926 5.6835 4.9040 4.6843 6.2400 5.3448 5.6159 5.8823 4.3677 4.3791 7.1368 7.2362 5.9069 6.2111 5.3361 3.3430 6.4782 6.4785 7.5214 6.5728 2.3943 2.0897 1.2682 2.9865 3.4106 6.6595 1.6089 1.5845 1.7956 4.2049 3.0130 2.8431 4.8452 1.9058 5.0211 4.4059 4.3545 1.9589 2.0565 1.5869 2.3629 4.1446 1.7709 3.1768 1.5074 1.4962 1.6493 1.4865 5.7257 2.5796 1.4133 1.4064 2.0084 2.3027 2.9485 1.4303 1.4352 1.3578 1.4650 1.5737 1.5506 1.4447 1.6154 1.4093 1.3770 1.3829 1.7638 1.9438 1.3681 1.9090 1.9197 2.0196 1.9611 1.9068 1.8307 1.8578 3.5273 1.1309 1.2954 1.3720 1.3625 1.2036 1.0874 1.0697 1.0693 1.7520 2.0271 1.8354 2.3070 2.3823 2.4367 2.5812 2.6141 2.0786 1.7802 1.9606 1.5823 1.5926 1.5779 2.3255 3.1074 4.5123 5.0775 5.0651 6.4705 8.0141 1.6082 1.4131 3.6580 4.5419 3.4899 2.4682 1.0819 1.0721 5.2139 1.1460 1.1507 2.9947 2.6328 2.6136 4.2696 4.6583 3.2835 3.1894 4.0597 3.4105 5.2015 4.3091 3.9478 4.0027 4.7710 7.3653 7.3557 7.4876 7.4915 7.9824 7.6626 7.6625 6.5213 9.0181 7.1117 7.1419 8.6625 7.4075 12.6101 12.5968 12.6775 12.6775 1.0418 1.0398 1.0969 1.0981 1.1047 1.1042 1.0884 1.0875 1.0892 1.0880 1.0882 1.0918 1.0917 1.0901 1.0907 1.0939 1.0905 1.0915 1.0964 1.0993 1.0909 1.0989 1.0945 1.0944 1.1000 1.0998 1.0999 1.0985 1.0943 1.0980
irintensity: 0.3115 0.3361 0.1161 0.4638 0.3172 2.2701 2.1904 1.7676 0.4780 0.3193 0.5427 0.5956 2.3284 1.6381 0.6880 3.3853 0.4299 1.6871 2.1247 0.3621 1.3492 3.9102 1.9150 1.4596 0.4426 0.7382 0.8924 0.2343 1.1403 2.4194 0.8588 0.6097 0.9506 3.8227 1.9594 1.1828 1.8329 1.0373 2.4898 7.4551 1.3460 3.5328 2.8946 37.3038 1.1614 3.0156 1.4698 7.9732 6.5286 0.5547 3.1691 2.0592 4.7384 0.0191 2.1936 3.2870 1.7981 3.3029 1.2146 2.6849 1.0853 0.6050 5.5131 2.5748 0.2708 0.6203 1.5308 0.2212 2.8804 5.7191 1.9842 15.7856 4.6756 1.5068 2.2116 21.1654 4.0164 3.2007 8.3530 1.1148 1.0980 6.2133 4.6534 7.8246 0.0172 8.4396 6.5133 10.8742 15.0411 1.5382 0.1030 36.3912 13.6993 47.8643 1.6193 1.9227 4.3272 1.3269 43.0099 1.5330 2.4798 2.8120 15.2686 19.3192 23.1091 11.6725 18.0526 0.1662 8.7410 0.3102 1.0235 0.5393 1.0873 1.2070 4.1552 0.0023 2.2689 17.4079 6.0667 54.2418 4.8853 9.1971 0.6182 1.3184 9.0106 1.8545 1.0148 1.5078 0.6516 0.0445 0.5743 8.4315 1.8778 0.4936 2.6850 2.1930 0.6001 5.5046 4.0105 13.9846 3.3840 20.1080 1.2201 4.3686 13.0012 0.2274 2.5477 2.3750 0.1500 0.1238 36.7329 0.9805 2.6818 6.1450 0.8871 4.0754 4.8267 3.1878 6.2051 0.7446 0.1089 2.6104 0.3053 1.4738 0.5207 0.9618 7.5225 0.3057 0.0072 20.0346 2.0921 8.5664 24.7415 10.2577 46.1363 17.9876 16.8174 14.7582 11.9156 265.9943 4.5596 1.3644 9.8131 7.2206 15.6251 4.4034 6.4243 137.2231 91.7911 30.6948 7.3775 182.2957 0.5446 6.2427 4.5957 38.1262 1.3282 9.7389 25.5428 26.9994 20.2249 16.1291 6.6179 5.7546 0.3031 4.1836 5.5905 48.6919 15.4531 509.5856 326.7724 14.7751 14.7822 11.3637 13.0216 10.1403 11.5264 8.8996 11.6071 1.4177 2.3364 6.7808 0.6735 5.1971 7.8955 6.7122 2.5624 0.8166 1.9638 2.6693 2.5528 3.0221 12.0121 7.2341 9.8842 6.6461 6.4453 9.5042 9.6289 9.1037 1.5592 5.3945 0.1091
temp: 353.000 k
press: 1.00000 atm
elementType: 6 6 6 6 6 1 1 1 7 6 6 8 8 7 7 6 6 6 1 6 6 6 6 1 46 6 1 6 1 6 6 6 1 6 6 1 1 6 6 1 1 1 6 1 6 1 6 1 1 1 6 6 6 1 6 6 1 1 6 6 6 6 7 7 7 6 6 6 6 6 1 6 1 6 6 1 6 1 1 1 1 1 1
symmnumber: 1
zpe: 1678094.6 jmol-1
zpe.correction: 0.639152 hartree
zpe.thermalcorrener: 0.699163 hartree
zpe.thermalcorrenthalpy: 0.700280 hartree
zpe.thermalcorrgfe: 0.534302 hartree
zpe.sumelectzpe: -2296.450359 hartree
zpe.sumelectthermal: -2296.390349 hartree
zpe.sumelectthermalent: -2296.389231 hartree
zpe.sumelectthermalfe: -2296.555209 hartree
dipole: -0.2677 -9.8920 0.0692
dipole: 9.8959
quadrupole: -336.5251 -274.8763 -320.6127
quadrupole: 2.2372 56.2146 -4.4059
quadrupole: -25.8537 35.7950 -9.9413 2.2372 56.2146 -4.4059
hfenergy: -2297.0895115 hartree
pointgroup: C01 [X(C44H30N6O2Pd1)]
dipole: -0.0919856 -3.8921955 0.022862 debye
polarizability: 688.6599679|8.8310095|604.2583813|63.0103809|-4.7180175|353.7316891 unknown
InChI: InChI=1S/C35H23N5O2.C9H7N.Pd/c1-22-26(28-12-5-3-10-24(28)20-36)14-7-16-30(22)39-34(41)32-18-9-19-33(38-32)35(42)40-31-17-8-15-27(23(31)2)29-13-6-4-11-25(29)21-37;1-2-6-9-8(4-1)5-3-7-10-9;/h3-19H,1-2H3;1-7H;/q-3;-1;+4
charge 0 multiplicity 1
83 atoms
C  -0.92125724 3.68878312 0.3049359
C  1.25184895 3.61767238 -0.62120401
C  1.30219393 5.00574281 -0.70249377
C  0.18794168 5.73304322 -0.26434788
C  -0.94023374 5.07908591 0.24688225
H  2.20431229 5.47256028 -1.10136897
H  0.20049319 6.82383126 -0.3189744
H  -1.82757191 5.60405207 0.60442586
N  0.15592835 3.03350136 -0.13136717
C  -2.02808086 2.80114857 0.84204204
C  2.35078939 2.65712945 -1.03768771
O  3.412582 3.07859976 -1.46908128
O  -3.06629308 3.29205428 1.25757244
N  -1.67835986 1.48439768 0.79881891
N  1.96741915 1.36104254 -0.86921436
C  2.83466254 0.28552859 -1.15599013
C  3.13771213 -1.82952226 -2.31185148
C  4.72788926 -1.12650982 -0.61172314
H  2.80763774 -2.55754987 -3.05590448
C  -2.56868368 0.47269876 1.21639987
C  -3.80476933 0.25714972 0.56334348
C  -2.85995041 -1.55136124 2.53082797
C  -4.55183308 -0.88813362 0.91784723
H  -2.50031721 -2.24318832 3.29559654
Pd 0.15052311 1.10484412 -0.00977182
C  4.28517583 -2.06508052 -1.5564218
H  4.86517743 -2.97983948 -1.70271515
C  -4.06747986 -1.78943121 1.87756637
H  -4.66346197 -2.67246485 2.12139856
C  5.93702614 -1.48402955 0.18230347
C  5.94441508 -2.67297371 0.92505172
C  7.05964442 -3.06537146 1.66475855
H  5.04229147 -3.29071573 0.91956432
C  8.23344793 -1.09228497 0.9360108
C  8.20844275 -2.27146731 1.67499348
H  7.03076957 -3.99418794 2.23862591
H  9.08404726 -2.57196806 2.25327316
C  4.00284169 0.06603525 -0.39112529
C  -4.22000242 1.1723249 -0.55188911
H  -4.64858429 2.10193438 -0.14766263
H  -3.33728973 1.4700584 -1.14243556
H  -4.95194441 0.701507 -1.22298568
C  -2.12312892 -0.41864156 2.20312927
H  -1.16411465 -0.20671844 2.68391845
C  2.42128689 -0.65451254 -2.11069663
H  1.50178929 -0.44738698 -2.66570318
C  4.36510748 1.05506214 0.67920118
H  3.45525642 1.37487844 1.21571533
H  5.07875461 0.64407809 1.40543148
H  4.79737514 1.96073349 0.22663876
C  -5.82702855 -1.2464073 0.23600174
C  -5.93060691 -2.48093175 -0.42152496
C  -7.10784453 -2.87136279 -1.05972394
H  -5.05475213 -3.13487804 -0.43013413
C  -8.15296661 -0.80703222 -0.39214491
C  -8.22305836 -2.03085802 -1.05120847
H  -7.15458628 -3.83701711 -1.56810219
H  -9.14642734 -2.33016708 -1.55047756
C  7.1105321 -0.69849445 0.18996981
C  -6.96823332 -0.41454884 0.25218977
C  -6.95959041 0.84100802 0.95742232
C  7.19519459 0.50977381 -0.58894487
N  7.30686846 1.48893921 -1.20212976
N  -7.00169576 1.85791312 1.51549157
N  0.25508979 -0.93733681 0.16722248
C  -0.6029467 -1.79359946 -0.47234749
C  1.22688402 -1.41756484 0.92560526
C  -1.63050705 -1.27854198 -1.30244913
C  -0.47377744 -3.20220062 -0.30669386
C  1.43266828 -2.79901469 1.12364142
H  1.88590474 -0.68064185 1.3942545
C  -2.51198731 -2.1360962 -1.91957868
H  -1.70732552 -0.19436682 -1.41877158
C  -1.39584977 -4.06183499 -0.96305983
C  0.57955485 -3.6864755 0.50984859
H  2.25633588 -3.13070181 1.75665895
C  -2.39700537 -3.53966568 -1.74868402
H  -3.31612974 -1.73003408 -2.53826687
H  -1.29048351 -5.14124563 -0.83008554
H  0.69859413 -4.76526112 0.6396663
H  -3.10493843 -4.20382333 -2.2492035
H  -9.0176114 -0.14168589 -0.35812904
H  9.12579685 -0.46395109 0.91857184
