program: Gaussian 09
title: 000036643
version: EM64L-G09RevD.01
frameworkgroup: C1[X(C14H22)]
method: RPBEPBE
basis: SDD
operation: Freq
keyword: #p
keyword: freq=noraman
keyword: PBEPBE/SDD
title: #p freq=noraman PBEPBE/SDD
converged: YES YES NO NO
title: Mulliken charges:
elementType: C C C C C C C C C C C C C C H H H H H H H H H H H H H H H H H H H H H H
charge: 0.196488 0.196463 0.146175 0.146281 0.146366 0.146214 -0.596546 -0.596532 -0.861361 -0.861349 -0.861525 -0.861542 -0.681115 -0.681119 0.222437 0.222271 0.222324 0.222367 0.233537 0.233857 0.237819 0.237769 0.233591 0.233876 0.233965 0.233614 0.237841 0.233547 0.237896 0.233943 0.220951 0.214386 0.220885 0.220935 0.214385 0.220907
chargesum: 0.00000
title: Mulliken charges with hydrogens summed into heavy atoms:
elementType: C C C C C C C C C C C C C C
charge: 0.196488 0.196463 0.146175 0.146281 0.146366 0.146214 -0.151838 -0.151842 -0.156148 -0.156114 -0.156104 -0.156157 -0.024892 -0.024892
polarizability: 1.86933807e+02 -2.76308619e-03 1.73565507e+02 6.25074733e+00 -2.45001765e-03 1.01065225e+02
1716.lowfreq: -0.0007 -0.0005 -0.0001 15.1806 16.0842 18.0092 60.6161 67.7972 76.7237
frequency: 60.6154 67.7971 75.7214 101.8504 112.1918 120.1072 121.4702 134.7152 137.9946 187.0864 212.8864 215.9199 221.0049 295.4361 343.6420 347.7366 364.7115 388.9019 400.0925 430.7461 448.0658 453.6719 493.0306 560.7209 569.1214 571.5702 581.1665 672.4133 757.0441 768.1553 770.9193 804.3544 851.4830 922.5773 965.4258 991.5951 998.9483 1006.0868 1006.5562 1016.5555 1037.7752 1047.0868 1057.8053 1062.4235 1081.9685 1082.2023 1093.3053 1101.6284 1114.1379 1249.8846 1250.0297 1257.3279 1311.1632 1320.5491 1328.0242 1351.3840 1386.8519 1389.5443 1390.6040 1394.2792 1401.6662 1403.4530 1415.5588 1424.9090 1457.5603 1461.7120 1465.6645 1468.3398 1472.4800 1475.2278 1477.6896 1482.6577 1488.4445 1488.9590 1489.4068 1502.8141 1530.3841 1535.9587 1583.0795 1585.2202 2965.4670 2966.4656 2967.1301 2967.2012 2976.4724 2976.7846 3010.5208 3010.7961 3043.8229 3044.1216 3047.4302 3047.4936 3050.3876 3050.4807 3072.8694 3073.0356 3079.8094 3080.2011 3103.0514 3103.2934 3106.0242 3106.5497
redmass: 1.5740 2.4804 1.1565 1.3242 1.2697 1.5603 2.0675 2.6072 2.1804 2.2418 1.0338 1.0196 3.0118 2.9881 2.2791 3.3516 2.7083 2.4209 4.2299 2.2135 4.8536 2.2658 4.2570 3.5770 2.2057 4.0031 3.2671 4.3649 1.4651 2.4199 3.7113 1.1494 1.7507 2.3868 1.9789 1.4096 1.8766 1.3729 1.4138 1.4174 1.7190 1.6027 2.1638 2.2839 1.8081 2.4937 1.7344 2.4746 1.7292 1.3102 3.6239 1.1868 1.9248 1.5340 3.2004 4.6824 1.2890 1.1975 1.2097 1.2075 1.2070 1.1761 3.0206 5.0775 1.0941 1.0844 1.0711 1.1319 1.0464 1.0611 1.0546 1.1597 1.0824 1.0492 1.0645 1.0615 1.0780 1.0908 5.9931 6.4571 1.0448 1.0448 1.0457 1.0457 1.0351 1.0351 1.0613 1.0615 1.0915 1.0913 1.0990 1.0995 1.0914 1.0909 1.0995 1.0994 1.1008 1.1007 1.0946 1.0945 1.0944 1.0944
irintensity: 0.0011 0.0428 0.0004 3.2890 0.0000 0.0061 0.0001 0.0056 0.0006 3.5713 0.1142 0.0001 0.0000 3.0455 1.3166 0.0000 2.2968 0.0001 0.0000 0.0001 0.0000 0.0126 0.0000 0.0000 0.0000 0.2056 0.4145 2.3907 10.1949 0.1300 0.0001 0.0000 3.0346 0.0000 19.6188 0.0002 0.0000 13.3688 8.0667 0.0000 0.0000 3.3996 34.1317 0.0000 0.9531 0.0488 7.4092 0.0001 0.0001 3.2307 0.1988 0.0000 0.0000 2.8468 0.0001 0.7720 14.5441 0.0001 0.0004 16.5975 36.3023 0.0015 0.9173 8.2638 0.0000 0.0005 18.4005 40.5568 0.0001 9.2973 0.0009 41.3522 11.4993 0.0954 0.0005 5.2279 17.1450 0.0001 0.0000 0.0001 135.2810 0.0005 0.0432 23.8708 89.1739 0.0020 60.5684 0.0223 0.4939 69.1867 6.3196 0.0084 15.6535 0.0013 122.6488 0.0320 0.0040 101.4994 10.7115 85.1747 0.5181 0.0205
temp: 298.150 k
press: 1.00000 atm
elementType: 6 6 6 6 6 6 6 6 6 6 6 6 6 6 1 1 1 1 1 1 1 1 1 1 1 1 1 1 1 1 1 1 1 1 1 1
symmnumber: 1
zpe: 839292.0 jmol-1
zpe.correction: 0.319669 hartree
zpe.thermalcorrener: 0.336402 hartree
zpe.thermalcorrenthalpy: 0.337347 hartree
zpe.thermalcorrgfe: 0.276441 hartree
zpe.sumelectzpe: -545.608419 hartree
zpe.sumelectthermal: -545.591686 hartree
zpe.sumelectthermalent: -545.590742 hartree
zpe.sumelectthermalfe: -545.651648 hartree
dipole: -0.0001 0.0002 -0.0001
dipole: 0.0002
quadrupole: -83.4850 -82.1124 -90.1221
quadrupole: -0.0010 1.7353 -0.0017
quadrupole: 1.7548 3.1274 -4.8822 -0.0010 1.7353 -0.0017
hfenergy: -545.9280888 hartree
pointgroup: C01 [X(C14H22)]
dipole: -0.0000229 -0.0000726 0.000025 debye
polarizability: 187.1312126|0.0003044|173.5655051|-4.6991468|-0.0085714|100.8678204 unknown
InChI: InChI=1S/C14H22/c1-7-13-9(3)11(5)14(8-2)12(6)10(13)4/h7-8H2,1-6H3
charge 0 multiplicity 1
36 atoms
C  -1.411197 0.000112 0.24584
C  1.410993 0.000343 -0.245302
C  -0.704404 1.232846 0.115273
C  0.70401 1.232926 -0.114417
C  -0.704207 -1.232547 0.114978
C  0.704186 -1.232475 -0.114721
C  -2.914705 0.000204 0.527577
C  2.914489 0.001155 -0.527114
C  -1.429611 2.571957 0.207637
C  1.429125 2.572047 -0.207297
C  -1.428934 -2.571939 0.207274
C  1.428949 -2.571897 -0.206418
C  -3.776387 0.000017 -0.764883
C  3.776246 -0.001349 0.765291
H  -3.1865 -0.877617 1.140682
H  -3.186394 0.878299 1.140397
H  3.186435 -0.875455 -1.141869
H  3.185965 0.880444 -1.138323
H  -1.264894 3.060475 1.189624
H  -1.066205 3.275659 -0.562466
H  -2.516729 2.47356 0.068402
H  2.515913 2.474051 -0.06509
H  1.266894 3.058718 -1.190626
H  1.063656 3.277076 0.560558
H  -1.06207 -3.2770 -0.559886
H  -1.267745 -3.05827 1.190944
H  -2.51556 -2.474597 0.063515
H  1.26468 -3.06048 -1.188447
H  2.515987 -2.474137 -0.066304
H  1.064573 -3.275321 0.563491
H  -3.559913 0.889526 -1.384267
H  -4.856482 0.000018 -0.526099
H  -3.559846 -0.889678 -1.383985
H  3.559468 0.886782 1.386543
H  4.856327 -0.000434 0.52644
H  3.560088 -0.892416 1.38255
