program: Gaussian 16
title: TS-5 using MN15/def2-SVP/def2-TZVPPD
version: ES64L-G16RevA.03
method: RMN15
basis: Gen
operation: Freq
keyword: #NGeom=AllCheck
keyword: Guess=TCheck
keyword: SCRF=Check
keyword: GenChk
keyword: RMN15/ChkBas
keyword: Freq
converged: YES YES YES YES
title: Mulliken charges:
elementType: C C C C C H H H N C C O O N C C C C H Pd C H C H H H C H C C C C H C C H H C N N N C C C C C H C H C C H C H C H H C H Pd H C H O O C H H C H H H H C C H H C C C C C C H C C H H C H C C C H N H O C C O H H N C H C O H H H H H
charge: 0.080198 0.078306 -0.003446 0.089637 -0.004187 0.016479 0.017169 0.018351 -0.163109 0.149632 0.140440 -0.223940 -0.221671 -0.320116 0.041838 -0.050853 0.006825 -0.066988 -0.018797 0.111861 0.037567 -0.031627 0.154760 0.022156 0.004042 0.049976 0.059601 -0.020494 0.043391 -0.021313 -0.120734 0.046549 -0.007241 0.042346 0.025221 0.000917 -0.001551 -0.154838 0.086741 -0.327523 -0.135715 0.003891 0.123377 0.095669 0.101978 0.040600 0.054313 0.024012 0.014122 0.091776 0.028862 0.010765 -0.009205 -0.000484 -0.011593 0.001367 0.028700 0.045103 0.019049 -0.186058 0.039276 0.215327 0.183490 -0.213857 -0.269231 0.134193 0.039377 0.036907 -0.016797 0.016050 0.021581 0.031020 0.003738 0.156184 -0.048561 0.042226 0.011277 -0.065714 0.049957 0.043579 0.064290 0.048572 0.003428 -0.025481 -0.020842 -0.134241 -0.012279 -0.017272 0.050307 0.004842 0.049090 -0.082945 0.023483 0.005779 0.163701 0.003473 -0.376306 0.159792 0.149415 -0.298478 0.018667 0.051917 -0.152112 0.009980 0.115300 0.033604 -0.249885 0.017831 0.035247 0.046994 0.005580 -0.007578
chargesum: -0.00000
title: Mulliken charges with hydrogens summed into heavy atoms:
elementType: C C C C C N C C O O N C C C C Pd C C C C C C C C C C N N N C C C C C C C C C C C Pd C O O C C C C C C C C C C C C C C C C N O C C O N C C O
charge: 0.080198 0.078306 0.013033 0.106806 0.014164 -0.163109 0.149632 0.140440 -0.223940 -0.221671 -0.320116 0.041838 -0.050853 -0.011972 -0.066988 0.111861 0.005940 0.230934 0.039107 0.043391 -0.028554 -0.120734 0.047465 0.034768 0.023671 -0.154838 0.086741 -0.327523 -0.135715 0.003891 0.177690 0.109792 0.101978 0.051366 0.023527 0.091776 0.030229 0.019495 0.007456 0.084379 -0.002569 0.215327 -0.213857 -0.269231 0.210477 0.051855 0.213425 -0.048561 -0.065714 0.049957 0.018099 0.064290 0.036293 -0.013844 -0.016000 -0.134241 0.056086 0.054670 -0.082945 0.026956 0.163701 -0.376306 0.159792 0.219999 -0.298478 -0.036812 0.009980 0.133676 -0.249885
1716.lowfreq: -344.9311 -2.2039 -1.5179 -0.3660 -0.0015 -0.0010 0.0058 8.9602 10.0210
redmass: 1.1506 7.0056 6.6705 7.0630 5.9103 6.5095 7.0137 6.1530 5.9544 4.5373 5.9286 5.5329 5.4293 6.5771 6.5134 5.0534 4.4393 4.9936 5.1142 5.1394 5.3049 5.2726 5.8184 6.0466 5.7660 5.0362 6.5123 3.3528 5.2826 3.2787 3.9380 3.7954 2.9554 6.5680 5.7582 4.8101 4.9085 6.2056 6.6942 4.5917 6.8671 4.0898 4.7780 4.3450 3.4127 4.5288 4.3731 3.2820 2.0374 2.6496 4.9796 2.2786 4.4307 3.1770 2.7178 3.3648 4.1049 4.3845 4.1725 5.0601 2.5453 4.8473 5.1947 6.3350 5.4541 4.9148 3.3502 3.3921 6.7563 4.4022 5.5323 4.3898 4.0684 5.3170 7.0145 4.1107 3.6368 4.0532 7.3025 5.0105 3.7053 4.6017 4.9160 4.3902 3.9431 4.4058 5.0638 4.5356 5.5432 5.8185 6.5868 3.4377 3.6679 6.2214 4.2955 2.9375 4.7834 3.0602 6.8439 3.9239 5.0212 2.5582 2.4288 6.5160 6.3115 4.4503 3.0987 4.4960 6.8312 3.8790 7.0198 4.9105 5.7384 5.4793 3.1736 1.2823 5.9797 4.1907 6.4683 7.3341 6.4726 5.8783 3.2159 2.1718 2.2287 3.7057 1.5014 5.0219 2.9403 2.1864 2.6422 3.4633 2.7745 1.9807 1.7626 1.8573 3.4157 2.4773 2.7320 4.5627 4.3717 1.8977 1.5712 1.7731 2.4370 3.9707 3.4481 3.4719 2.8643 2.4542 3.3063 1.4713 1.4564 1.4373 1.6194 1.7560 4.4422 1.4982 1.4523 1.5498 2.3969 1.4524 1.9573 1.9184 1.6299 2.8715 1.4420 1.8035 1.4425 1.9031 1.5018 1.6291 1.3999 1.5490 1.6367 2.9792 1.6715 1.4701 1.3785 3.0867 1.3822 1.3717 1.9605 1.9205 1.9993 2.0185 2.1119 1.9869 1.7496 3.3608 1.9829 1.9639 1.8640 1.1323 1.3999 1.3767 1.1702 1.0727 2.4435 1.0743 1.7424 1.3347 1.8400 1.6880 1.7404 1.8451 2.4172 2.4613 2.5976 2.5111 2.1339 1.6978 1.2438 1.9971 1.4969 1.9591 1.7765 1.6124 1.6986 2.1020 2.2189 1.5630 1.2037 2.7298 3.6890 1.6538 5.2722 5.4889 1.4848 7.7188 2.3899 3.5393 2.0001 1.5445 2.0635 4.0107 1.1321 3.6347 1.1459 1.8427 1.0983 1.1067 2.7794 4.4168 1.8137 1.0627 1.1857 1.1895 5.8302 1.1497 1.8104 1.8518 2.8054 2.6028 1.2059 4.5779 3.3076 3.2828 3.0245 4.4401 4.7540 4.3114 4.0209 4.0714 3.6664 3.0713 5.1248 7.2292 7.2328 7.5907 7.2348 7.0946 7.4879 7.4525 7.7311 9.0801 7.0512 7.1761 8.2007 7.9548 12.1500 12.5371 12.5115 10.4140 11.6592 1.0177 12.6794 12.6889 1.0430 1.0378 1.0380 1.0370 1.0635 1.0630 1.0978 1.1005 1.1023 1.1035 1.1050 1.0913 1.1061 1.1046 1.1021 1.1067 1.0913 1.0893 1.0917 1.1055 1.0877 1.0915 1.0926 1.0875 1.0940 1.0879 1.0897 1.0912 1.0909 1.0915 1.0987 1.0990 1.0959 1.0967 1.0960 1.1003 1.0898 1.1004 1.0943 1.0978 1.0980 1.0771
irintensity: 24.1726 0.3406 0.2227 0.4113 0.3117 0.3057 0.3481 1.2507 0.2593 0.0514 1.0900 0.2067 1.4015 0.5166 1.7451 1.6976 3.4407 3.2766 0.8884 1.2007 2.6410 6.9815 1.1830 1.0180 2.0384 1.8006 9.8267 3.9355 0.4910 1.1900 1.1224 0.6539 8.8699 1.9017 3.4516 0.8499 4.9256 0.5098 1.6992 4.7930 7.5405 6.1951 0.5987 0.7498 3.3654 2.0158 1.9801 9.9026 0.4325 9.9583 1.1726 3.5451 7.8703 1.3196 0.0561 6.9136 1.3796 2.0374 1.6848 5.7991 11.7799 0.8022 3.3001 5.7508 8.0848 5.3636 0.6915 28.9610 24.0010 1.4996 2.9174 0.3907 5.4307 11.1076 13.3323 2.3187 20.8788 0.5477 0.2484 2.0884 1.4500 16.2966 5.2329 20.2543 0.8224 7.2225 4.6787 0.2595 6.5697 1.0451 2.3280 2.4423 0.0829 0.4094 69.4848 71.6043 12.3083 19.2650 3.0069 2.5756 4.9483 15.0918 9.8310 5.6850 0.4981 3.3025 16.1065 6.6459 28.8358 1.7647 10.2075 2.3719 2.2169 0.4707 72.0718 33.8244 5.9187 4.0678 8.3697 13.0531 0.6551 65.5079 28.6137 19.6762 5.7688 18.7119 2.9818 1.9568 10.9521 4.5919 23.0702 5.9176 17.2845 14.8705 22.1747 19.4809 1.6416 4.6950 3.0050 0.8088 0.4253 22.9521 69.4709 6.8206 10.4881 15.9357 0.1669 0.9396 4.2235 3.5259 7.7437 0.0453 0.3532 4.0843 2.9222 5.3698 18.2151 1.7515 3.3617 1.9637 3.2933 0.0627 23.9797 8.3088 3.6762 29.2953 2.6794 5.6166 0.8060 18.1328 1.0605 8.7331 2.2765 5.7580 3.7322 7.8685 3.9936 3.0274 0.0775 12.0804 0.2516 0.4891 1.8337 1.0808 4.5019 8.5127 7.3266 15.2657 1.9911 20.0376 12.3172 4.2619 19.4907 0.8739 12.0626 3.4364 3.3850 1.0962 1.4413 2.0120 24.7013 2.1817 3.9065 8.7426 40.4704 2.5482 11.2372 1.8532 1.0816 4.7391 1.6138 4.0680 1.3139 20.3107 4.5856 3.3697 2.0590 0.3747 43.3119 173.3892 0.0272 51.0385 13.7877 2.4074 0.7286 251.4260 5.8512 6.2523 37.0023 8.1481 9.3785 14.1818 27.3600 25.1286 284.8711 44.4830 60.1537 31.2954 26.3452 2.2829 12.5153 21.9256 50.1592 315.3406 87.3438 7.3139 14.5446 26.3234 19.3346 14.1951 236.4380 332.3690 35.8615 9.6037 39.0429 48.4235 23.0698 105.8938 74.1877 54.5090 233.2725 0.9769 13.6324 3.8612 12.6583 292.3276 25.0185 23.9602 5.1153 23.5595 40.9122 14.8669 40.7757 14.9324 6.8472 0.0973 26.1397 13.2811 81.3706 25.5920 398.2375 494.1636 421.2402 193.7433 188.9195 35.2535 62.2726 112.7814 8.6532 10.4490 3.5157 21.7519 7.9408 23.8305 8.4253 8.4418 12.2319 18.4011 8.5413 9.2247 9.0180 4.1807 12.2475 8.3452 0.3793 3.3563 0.3163 5.2107 0.1983 7.6394 7.6777 1.0999 2.3236 0.7629 1.0158 1.1808 7.4771 0.6722 9.2469 6.0254 4.9680 2.2018 2.6427 9.8021 0.8648 6.5467 4.4200 0.0789 5.2043 23.5824
temp: 353.000 k
press: 1.00000 atm
elementType: 6 6 6 6 6 1 1 1 7 6 6 8 8 7 6 6 6 6 1 46 6 1 6 1 1 1 6 1 6 6 6 6 1 6 6 1 1 6 7 7 7 6 6 6 6 6 1 6 1 6 6 1 6 1 6 1 1 6 1 46 1 6 1 8 8 6 1 1 6 1 1 1 1 6 6 1 1 6 6 6 6 6 6 1 6 6 1 1 6 1 6 6 6 1 7 1 8 6 6 8 1 1 7 6 1 6 8 1 1 1 1 1
symmnumber: 1
zpe: 2261356.3 jmol-1
zpe.correction: 0.861305 hartree
zpe.thermalcorrener: 0.946463 hartree
zpe.thermalcorrenthalpy: 0.947580 hartree
zpe.thermalcorrgfe: 0.724876 hartree
zpe.sumelectzpe: -3204.118476 hartree
zpe.sumelectthermal: -3204.033319 hartree
zpe.sumelectthermalent: -3204.032201 hartree
zpe.sumelectthermalfe: -3204.254905 hartree
dipole: 4.9305 3.2638 1.6048
dipole: 6.1267
quadrupole: -423.5383 -365.3490 -431.5904
quadrupole: -46.2898 -15.3124 -17.4047
quadrupole: -16.7124 41.4769 -24.7645 -46.2898 -15.3124 -17.4047
hfenergy: -3204.9797813 hartree
pointgroup: C01 [X(C53H43N7O7Pd2)]
dipole: 1.8593942 1.3938213 0.6404494 debye
polarizability: 909.4109622|-20.2454335|815.7793516|-23.5533469|-29.6336158|485.6216326 unknown
InChI: InChI=1S/C35H23N5O2.C14H13NO2.C4H6NO3.2Pd.H/c1-22-26(28-12-5-3-10-24(28)20-36)14-7-16-30(22)39-34(41)32-18-9-19-33(38-32)35(42)40-31-17-8-15-27(23(31)2)29-13-6-4-11-25(29)21-37;1-2-17-14(16)9-8-11-5-3-7-13-12(11)6-4-10-15-13;1-3(6)5-2-4(7)8;;;/h3-19H,1-2H3;3-10H,2H2,1H3;5H,2H2,1H3;;;/q-3;2*-1;+1;+4;
charge 0 multiplicity 1
112 atoms
C  5.66792349 2.49982138 -1.69293757
C  4.27610419 4.16666312 -0.75833373
C  5.15163056 5.17251375 -1.15695974
C  6.31457719 4.80032976 -1.84350497
C  6.58667218 3.45411248 -2.119187
H  4.9034453 6.20764203 -0.9173869
H  7.01912432 5.56979923 -2.16677114
H  7.48005398 3.11971796 -2.64899208
N  4.57315629 2.8971896 -1.04160516
C  5.77379114 0.99887163 -1.893098
C  2.98541544 4.35724521 0.01581229
O  2.64050317 5.47663115 0.37127314
O  6.74768351 0.5180133 -2.45714634
N  2.36046614 3.17006813 0.25394395
C  4.57763531 -1.05655497 -1.42773227
C  5.42190083 -1.87597971 -0.6469147
C  3.30739339 -2.98855846 -2.16745526
C  5.18361511 -3.26701152 -0.64902905
H  2.48958887 -3.41729299 -2.75022351
Pd 3.32118717 1.53484427 -0.48552063
C  4.14089177 -3.812096 -1.41266643
H  3.97946895 -4.89287683 -1.3917781
C  6.5216205 -1.23016573 0.14750317
H  6.10623908 -0.45952526 0.81933974
H  7.08724941 -1.94939962 0.75185294
H  7.22087016 -0.72442041 -0.53483057
C  3.52894309 -1.6149337 -2.17016872
H  2.88516335 -0.93680732 -2.73793136
C  6.01317331 -4.21593006 0.14776158
C  6.7890794 -5.18740514 -0.4957183
C  6.00410512 -4.21234945 1.56035422
C  7.54372764 -6.10897621 0.23142113
H  6.80087775 -5.20399041 -1.58800204
C  6.76439271 -5.13652991 2.29407183
C  7.53675517 -6.08369548 1.62797654
H  8.1452623 -6.85129072 -0.29757768
H  8.12865969 -6.80280842 2.19692854
C  5.18544569 -3.25929671 2.26192724
N  4.52588507 -2.49520894 2.83652603
N  4.69202785 0.35155021 -1.3848205
N  2.01598573 0.0782596 0.10774702
C  0.75079323 -0.0157047 -0.41263726
C  2.41466272 -0.75393431 1.05616012
C  0.3756496 0.83965289 -1.48008379
C  -0.1716501 -0.97586897 0.09774392
C  1.56706707 -1.73254106 1.60894987
H  3.4457825 -0.65338836 1.40967397
C  -0.86904906 0.70735075 -2.05189578
H  1.09890905 1.57844109 -1.83571038
C  -1.48653401 -1.06150851 -0.47708274
C  0.27667968 -1.82791071 1.14005238
H  1.95941975 -2.38170114 2.3911753
C  -1.78887577 -0.24696367 -1.5657638
H  -1.15551794 1.34678087 -2.88914119
C  -2.53270511 -1.91496078 0.11766027
H  -0.39559211 -2.57967294 1.5554183
H  -2.76747565 -0.32720305 -2.05351136
C  -3.65303914 -2.38188241 -0.62342387
H  -2.33539312 -2.42537137 1.06278554
Pd -4.11399347 -0.54701165 0.18831139
H  -3.703772 -2.29707455 -1.71339928
C  -4.52928262 -3.44068016 -0.03407444
H  -4.45288236 -1.29428162 1.42113294
O  -4.46550401 -3.81049254 1.11881039
O  -5.38118559 -3.89834044 -0.93837314
C  -6.45073968 -4.72638642 -0.4682645
H  -7.24123128 -4.61181436 -1.22093916
H  -6.80197144 -4.30185549 0.48483222
C  -6.00840823 -6.16640266 -0.30972169
H  -6.8620511 -6.78968087 -0.00560365
H  -5.61795469 -6.56229096 -1.25858264
H  -5.22940755 -6.24713363 0.46082983
H  0.57993261 4.10408225 -1.34672937
C  -0.03600109 4.6048003 -0.58274401
C  0.01834994 3.81937273 0.69724661
H  0.39484575 5.60919557 -0.4543348
H  -1.06277444 4.69738971 -0.962062
C  -1.10244201 3.69862454 1.54965113
C  1.19542116 3.12245532 1.04766646
C  -1.07128508 2.85045477 2.66552416
C  -2.3279526 4.51093835 1.32556568
C  1.21483193 2.29773435 2.18397933
C  0.08597494 2.13980525 2.97927715
H  -1.95255209 2.77741151 3.30822377
C  -2.25185909 5.90947344 1.262112
C  -3.609648 3.92604813 1.22306659
H  2.14996129 1.78581223 2.42575118
H  0.11542243 1.49231211 3.85790149
C  -3.39692671 6.69073263 1.11987886
H  -1.2693694 6.37992779 1.34443924
C  -4.7684051 4.7111773 1.07914413
C  -3.75314453 2.49950682 1.1898373
C  -4.66008379 6.09542906 1.03238397
H  -3.30482948 7.77833518 1.08328547
N  -3.91351449 1.35504719 1.10409801
H  -5.55502785 6.70996257 0.92194352
O  -5.90302318 0.12286748 -0.78886748
C  -6.86242171 -0.68368135 -0.5144607
C  -8.14211158 -0.44730122 -1.3240431
O  -6.83166071 -1.59431649 0.31741277
H  -8.38937908 0.62369322 -1.31183298
H  -7.93801067 -0.73220856 -2.3655685
N  -9.23607756 -1.25277407 -0.84442288
C  -9.29886506 -2.56567548 -1.23390772
H  -9.52531979 -1.07329946 0.11321887
C  -10.11237187 -3.46026675 -0.32741224
O  -8.72708796 -2.98732511 -2.22558926
H  -10.95884373 -2.93232767 0.13383735
H  -10.47114437 -4.3243362 -0.89841288
H  -9.44832168 -3.81667935 0.47620504
H  -5.7392224 4.21993867 0.99289128
H  6.73458853 -5.1062368 3.38474645
