program: Gaussian 16
title: Free E calculation
version: ES64L-G16RevA.03
method: RMN15
basis: Gen
operation: Freq
keyword: #
keyword: mn15/gen
keyword: pseudo=read
keyword: freq=noraman
keyword: temperature=353
keyword: guess=read
title: # mn15/gen pseudo=read freq=noraman temperature=353 guess=read
converged: NO NO NO NO
title: Mulliken charges:
elementType: C C C C H H N H C N N C C O O C C C C C C H H C C C C C C H H C C C C H C C H H C H H C N C C C C C H C H C C H C H H H N Pd H C O O N C C H H H O C H H Pd H C H H H H C C C C H C C C H N H H F F
charge: 0.073461 0.074295 -0.002655 -0.001135 0.020379 0.023107 -0.163788 0.019939 0.089822 -0.329523 -0.330209 0.143376 0.150246 -0.201441 -0.210607 0.026446 -0.048400 0.055663 -0.057438 0.009036 0.030187 -0.021669 -0.030199 0.037431 -0.047771 0.050106 -0.074520 0.004880 0.061134 -0.012824 0.001179 0.142290 -0.055039 -0.141869 0.137057 -0.044494 0.309561 -0.029661 0.016853 0.012197 0.161522 0.037912 0.015973 -0.229597 0.166285 0.032877 0.119906 0.113776 0.078980 0.061278 0.066397 0.046828 -0.026377 -0.189702 0.077876 0.004331 0.004234 -0.010870 0.016580 0.010793 -0.125710 -0.084202 0.244496 0.194988 -0.218148 -0.330710 -0.298818 0.067793 0.083859 0.054873 0.046531 0.052877 -0.253515 0.090685 0.054955 0.048254 0.104603 0.045397 0.157090 0.022382 0.062626 0.003951 -0.016079 0.059363 -0.030586 -0.167207 0.054998 -0.026648 0.254266 -0.204337 -0.049989 0.000280 0.147580 0.003805 -0.024397 -0.123627 -0.146083
chargesum: -0.00000
title: Mulliken charges with hydrogens summed into heavy atoms:
elementType: C C C C N C N N C C O O C C C C C C C C C C C C C C C C C C C C N C C C C C C C C C N Pd C O O N C C O C Pd C C C C C C C C N F F
charge: 0.073461 0.074295 0.017723 0.021972 -0.163788 0.109761 -0.329523 -0.330209 0.143376 0.150246 -0.201441 -0.210607 0.026446 -0.048400 0.039584 -0.057438 -0.012632 -0.000013 0.037431 -0.047771 0.025710 -0.074520 -0.007943 0.062313 0.142290 -0.099533 -0.141869 0.153910 0.309561 -0.017463 0.260803 -0.229597 0.166285 0.032877 0.186303 0.087399 0.078980 0.065610 0.035958 -0.189702 0.094456 0.015026 -0.125710 -0.084202 0.194988 -0.218148 -0.330710 -0.298818 0.067793 0.238140 -0.009019 0.193893 0.104603 0.246048 0.059363 -0.057234 -0.167207 0.055278 0.254266 -0.204337 -0.046184 0.147580 -0.123627 -0.146083
chargesum: 0.00000
1716.lowfreq: -1272.6515 -0.0004 -0.0003 0.0008 3.4280 4.1737 7.0401 11.9441 14.8329
redmass: 1.1330 7.2309 8.8501 9.4409 8.0672 8.3265 8.1772 6.4481 5.8566 8.4026 7.8384 8.3297 8.6771 4.3462 7.9946 6.0464 8.2545 9.6276 6.6024 7.4185 7.9242 7.4158 7.0541 7.5554 2.6306 3.0054 5.6701 4.6143 5.8690 6.9839 2.7278 4.5496 4.5310 5.4250 7.0448 7.1735 5.4783 3.5189 4.2604 5.0873 1.5612 5.6518 5.7438 4.1950 3.7717 5.0606 5.4571 3.7468 3.1965 1.6749 5.7924 6.4773 6.1307 5.4613 5.4858 5.3156 4.6064 6.7109 5.8119 5.4738 5.6441 6.0564 9.5051 3.4134 5.9755 4.7954 6.2064 6.8357 7.8270 4.8767 7.7429 5.6429 5.7884 5.0843 10.5860 8.0587 5.3442 4.0698 4.7655 4.0932 4.1344 4.4829 6.6737 4.4043 3.7146 5.1351 6.2419 5.7843 4.6684 7.0117 2.6962 6.2864 5.9613 6.5433 5.5104 5.2687 6.0763 4.0491 2.8069 6.1319 5.5912 5.9440 4.8261 6.1121 5.8011 5.6509 6.6713 7.8839 6.0071 6.7216 3.1065 2.0757 3.0094 5.7358 3.0758 1.4811 2.2128 3.1194 7.4822 4.3049 1.8769 4.1116 4.4262 5.2322 1.9179 3.0232 2.0057 1.5586 2.4194 2.0075 3.2741 4.9316 2.3844 6.7242 2.5685 1.4791 1.4860 2.6299 1.6106 1.6995 1.6745 4.5314 1.6691 2.4555 3.5509 1.4241 1.3977 2.2917 2.9735 1.2883 1.3979 1.4933 1.6995 1.7925 1.8027 1.4944 1.3587 1.5511 1.3595 1.7689 1.4076 2.2303 2.4359 1.9129 2.0497 1.6616 1.8927 1.7501 1.6894 3.5105 1.4117 1.1291 1.3016 1.2829 1.1184 1.2654 1.2676 2.0885 2.9099 3.1829 1.7664 1.9260 1.2475 1.8432 3.3675 2.4771 2.6613 2.2606 2.0205 1.6978 1.9169 1.8392 1.3250 2.1299 1.6573 3.4789 5.0066 5.2110 1.3739 3.8343 2.7411 4.2025 5.1311 1.6022 1.9943 1.5286 4.4200 3.5722 3.2080 1.9876 3.1634 1.1011 1.2872 1.0847 1.2522 3.4024 2.3049 1.0870 1.0939 1.1491 5.6549 4.8240 3.3722 3.2976 3.3509 4.2692 5.3237 4.5082 5.0826 4.3542 5.3682 4.5430 7.1468 4.5517 8.1427 7.2557 7.6296 7.5677 6.8320 7.5759 7.7814 8.4268 7.9854 9.0113 7.6630 8.3653 8.6176 6.9637 12.6867 12.8132 12.8782 12.6733 12.6751 1.0411 1.0424 1.0603 1.0387 1.1055 1.0969 1.0965 1.1021 1.1045 1.1037 1.0899 1.0881 1.0882 1.0919 1.0896 1.0916 1.0912 1.0930 1.1058 1.0935 1.0904 1.0974 1.0910 1.0945 1.0991 1.0992 1.0912 1.0972 1.0943 1.0981 1.0980 1.0964
irintensity: 3055.6619 0.0761 0.2129 0.9025 0.9698 0.5082 0.2184 1.6864 1.8079 1.5814 0.1657 2.3902 1.9714 2.6690 1.7956 4.0379 1.3590 1.8333 2.2880 0.4106 2.8625 1.0389 2.3385 1.5488 1.6579 2.9233 3.2534 1.7256 0.9522 1.5947 0.5849 1.4497 0.1254 2.1417 1.6821 7.6060 0.1257 0.1716 0.3637 2.3820 0.9405 2.1819 1.7992 0.2032 1.1267 0.1708 1.1698 0.6134 2.5962 3.0537 1.3876 2.7791 6.6511 19.4621 1.2261 1.6330 1.2667 3.0642 12.8502 11.2517 18.6913 3.7079 12.5231 1.4437 6.8643 8.6104 1.0361 7.7049 60.4661 1.9308 0.6074 2.3278 1.2663 9.9674 5.0422 7.9786 16.2536 4.3126 1.1234 2.7429 5.1595 2.8838 2.3592 4.0050 2.1056 0.0870 3.0412 2.0480 7.8258 7.4540 3.9897 2.7955 1.8916 11.9893 0.4716 3.9912 6.8526 12.7266 5.4985 6.2002 0.5839 3.9144 8.0355 27.3661 0.7465 0.1799 3.4348 18.6600 11.8334 3.7674 7.1118 3.9556 20.8986 3.7986 7.3136 3.2051 20.5905 1.0543 0.7623 1.4582 19.9960 1.5787 8.1304 3.6897 23.4702 13.3089 62.7687 17.2946 9.6806 24.4725 7.2009 17.7680 9.8614 49.2040 25.5765 14.6837 2.9186 15.2163 3.6991 10.3370 6.4848 31.3400 1.4057 4.9474 0.1730 1.6768 0.0603 2.4490 32.8835 23.0215 0.7128 0.9741 6.1436 6.8636 6.5536 2.1188 1.1230 1.7369 1.7118 6.0053 0.2178 5.2471 17.0506 3.6087 3.5630 2.5812 1.2817 4.3777 3.1096 21.4631 22.5118 1.6512 7.2027 11.2235 0.2215 3.6598 3.5968 10.3312 20.2337 30.3734 73.6223 0.6791 1.1074 11.4249 6.2025 0.2536 4.3134 4.4252 16.8959 5.8405 0.5090 6.0053 52.9546 32.5147 20.1129 15.7605 25.1188 11.5743 10.9831 46.6410 972.1207 15.8088 30.8669 4.2749 16.7151 19.8501 30.0110 23.2919 15.0803 32.3309 39.6467 12.1921 34.5211 13.5915 11.3363 185.1648 79.2465 12.3647 13.2574 0.7966 0.8579 5.1460 11.3239 88.3469 12.0570 77.7859 339.1600 30.0204 109.3234 8.4080 23.7198 5.8992 33.1476 38.1015 156.3672 7.7171 25.8702 22.0745 8.8434 62.6302 55.1667 45.7041 80.7427 0.4183 24.0701 21.9688 40.4154 458.7165 509.7145 434.6741 761.0052 12.5673 10.6489 14.0412 7.1001 23.1095 0.7698 5.3226 10.6802 5.4217 0.9986 9.6862 10.3677 3.9799 2.7048 1.2145 10.0236 1.4939 0.4733 9.6385 3.1852 0.9711 0.3074 0.9090 1.5596 6.3265 4.1415 10.1248 6.2368 4.3772 0.4203 5.4497 0.1994 0.1324 0.7889
temp: 353.000 k
press: 1.00000 atm
elementType: 6 6 6 6 1 1 7 1 6 7 7 6 6 8 8 6 6 6 6 6 6 1 1 6 6 6 6 6 6 1 1 6 6 6 6 1 6 6 1 1 6 1 1 6 7 6 6 6 6 6 1 6 1 6 6 1 6 1 1 1 7 46 1 6 8 8 7 6 6 1 1 1 8 6 1 1 46 1 6 1 1 1 1 6 6 6 6 1 6 6 6 1 7 1 1 9 9
symmnumber: 1
zpe: 1877476.9 jmol-1
zpe.correction: 0.715093 hartree
zpe.thermalcorrener: 0.790509 hartree
zpe.thermalcorrenthalpy: 0.791627 hartree
zpe.thermalcorrgfe: 0.594114 hartree
zpe.sumelectzpe: -3057.278205 hartree
zpe.sumelectthermal: -3057.202789 hartree
zpe.sumelectthermalent: -3057.201671 hartree
zpe.sumelectthermalfe: -3057.399184 hartree
dipole: 0.7681 -6.9401 -1.7313
dipole: 7.1939
quadrupole: -512.7578 -369.4089 -357.8919
quadrupole: -60.3366 -28.6298 -10.2684
quadrupole: -99.4049 43.9440 55.4610 -60.3366 -28.6298 -10.2684
hfenergy: -3057.993298 hartree
pointgroup: C01 [X(C48H33F2N7O5Pd2)]
dipole: 0.3021919 -2.7304516 -0.6811502 debye
polarizability: 764.3699823|-40.2496899|700.3549756|-36.1917444|-11.988358|476.6294417 unknown
InChI: InChI=1S/C35H21F2N5O2.C13H12N2O3.2Pd/c1-20-22(24-10-3-12-28(36)26(24)18-38)8-5-14-30(20)41-34(43)32-16-7-17-33(40-32)35(44)42-31-15-6-9-23(21(31)2)25-11-4-13-29(37)27(25)19-39;1-9(15-8-13(16)17)18-19-12-6-2-5-11-10(12)4-3-7-14-11;;/h3-17H,1-2H3;2-7H,8H2,1H3;;/q2*-3;+2;+4
charge 0 multiplicity 1
97 atoms
C  -2.531277 4.776142 0.308639
C  -4.392468 3.341634 0.046493
C  -3.345999 5.808159 0.763474
C  -5.264085 4.33042 0.492567
H  -2.882105 6.756391 1.040029
H  -6.329409 4.100687 0.549071
N  -3.086896 3.608387 -0.025368
H  -5.38609 6.366612 1.202706
C  -4.724429 5.572698 0.849435
N  -3.689284 1.22374 -0.791364
N  -0.527839 3.649867 -0.311697
C  -4.775261 1.934036 -0.372597
C  -1.017037 4.819437 0.185104
O  -5.937587 1.565778 -0.313448
O  -0.39003 5.80298 0.544169
C  -3.792697 -0.135195 -1.158216
C  -4.18097 -1.122738 -0.221959
C  -3.344437 -0.504108 -2.434034
C  -4.073551 -2.477336 -0.605499
C  -3.246589 -1.842468 -2.799273
C  -3.599823 -2.826517 -1.878972
H  -2.896715 -2.119979 -3.795667
H  -3.523146 -3.883995 -2.143232
C  0.861759 3.403101 -0.390446
C  1.450629 2.574507 0.591747
C  1.620193 3.864242 -1.470985
C  2.7700 2.118843 0.38708
C  2.94401 3.452443 -1.633515
C  3.507401 2.559986 -0.725608
H  3.531958 3.812528 -2.480182
H  4.528002 2.195043 -0.867332
C  3.399066 1.155945 1.33027
C  2.72624 -0.051277 1.660559
C  4.644323 1.39918 1.928064
C  3.257044 -0.940127 2.619256
H  1.693159 -0.163307 1.330386
C  5.170912 0.464955 2.845353
C  4.493786 -0.687033 3.2132
H  2.675726 -1.818019 2.91128
H  4.945533 -1.361708 3.940139
C  0.647443 2.274185 1.82965
H  -0.154208 1.540224 1.636207
H  1.271699 1.896566 2.649452
C  5.40023 2.595025 1.678527
N  6.020152 3.558397 1.496729
C  -0.17799 -0.275678 -0.731026
C  0.092698 1.230275 -2.488413
C  -0.925205 -0.741123 0.382673
C  1.000068 -0.972446 -1.111321
C  1.228141 0.549281 -2.975335
H  -0.264531 2.139308 -2.980386
C  -0.514779 -1.863825 1.073718
H  -1.825099 -0.19124 0.668119
C  1.4887 -2.059198 -0.314518
C  1.697015 -0.531035 -2.267934
H  1.728782 0.91612 -3.871327
C  0.701736 -2.509276 0.737879
H  -1.122301 -2.234919 1.903145
H  2.598535 -1.069339 -2.573946
H  1.038064 -3.359324 1.339836
N  -0.573853 0.848485 -1.411368
Pd 3.610454 -1.610508 0.063413
H  2.154389 -3.011567 -1.032247
C  6.405023 -1.545005 -0.383798
O  7.574624 -1.262971 -0.29832
O  5.45825 -1.020715 0.364867
N  4.474701 -2.759959 -1.297822
C  3.831293 -3.68756 -1.976538
C  4.579863 -4.579133 -2.92938
H  3.866848 -5.219739 -3.458031
H  5.158175 -3.983203 -3.649556
H  5.294913 -5.204621 -2.374536
O  2.579026 -3.864333 -1.853581
C  5.911306 -2.571306 -1.403233
H  6.210105 -2.213014 -2.403268
H  6.465518 -3.507111 -1.220979
Pd -1.919557 2.211302 -0.672499
H  0.151467 3.19371 2.173403
C  -4.576853 -0.706561 1.165362
H  -3.947234 0.134996 1.501879
H  -5.613975 -0.337729 1.173206
H  -4.48405 -1.528004 1.888984
H  -3.054199 0.294754 -3.12173
C  -4.355203 -3.595258 0.337894
C  -3.335988 -4.509659 0.637162
C  -5.627102 -3.797018 0.918754
C  -3.55908 -5.585712 1.498062
H  -2.352945 -4.357545 0.184904
C  -5.827077 -4.883769 1.78271
C  -6.741937 -2.939088 0.631076
C  -4.809922 -5.780044 2.082655
H  -2.747851 -6.28259 1.718685
N  -7.65401 -2.256331 0.411521
H  -5.017836 -6.609455 2.759738
H  1.144446 4.535336 -2.190188
F  6.340363 0.72666 3.388432
F  -7.027769 -5.056262 2.315667
