program: Gaussian 16
title: fromts-1_irc_1mn15.log (failed at 3rd data point)
version: ES64L-G16RevA.03
method: RMN15
basis: Gen
operation: Freq
keyword: #N
keyword: Geom=AllCheck
keyword: Guess=TCheck
keyword: SCRF=Check
keyword: GenChk
keyword: RMN15/ChkBas
keyword: Freq
title: from ts-1_irc_1mn15.log (failed at 3rd data point)
converged: YES YES NO YES
title: Mulliken charges:
elementType: C C C C C H H H N C C O O N C C C H C C C C H Pd C H C H C C C C H C C H H C C H H H C C H C H C H H H C C C C H C C H H F F C N N C C C C C H C H C C H C H H H H N Pd N O C O N C H H C C H H H O
charge: 0.079819 0.076543 -0.003546 0.090064 -0.003543 0.017386 0.017912 0.019031 -0.163343 0.150805 0.141112 -0.220970 -0.221927 -0.327173 0.031932 0.010790 -0.096654 -0.005316 0.043999 -0.051288 0.009872 -0.073991 -0.011499 0.124631 0.043858 -0.010137 0.035258 -0.028796 0.069644 -0.015919 -0.187572 0.058781 0.001052 0.270932 -0.047741 0.015295 0.012553 -0.027171 0.154570 0.024221 0.004126 0.050748 -0.106888 0.054106 -0.021141 0.055871 -0.007536 0.153236 0.045221 0.017184 0.004909 0.057176 -0.022226 -0.174430 0.055905 -0.007165 0.258974 -0.047889 0.008401 0.005971 -0.140354 -0.147345 -0.168541 0.105420 -0.326542 0.027118 0.122527 0.116972 0.102673 0.050803 0.057640 0.009217 -0.007859 -0.063655 0.093929 0.009084 0.080410 -0.005926 0.074965 0.010591 0.021755 -0.130832 0.068065 0.229838 -0.317984 0.184087 -0.221239 -0.333851 0.107734 0.040060 0.037385 0.063131 0.066534 0.035225 0.026402 0.037184 -0.302647
chargesum: -0.00000
title: Mulliken charges with hydrogens summed into heavy atoms:
elementType: C C C C C N C C O O N C C C C C C C Pd C C C C C C C C C C C C C C C C C C C C F F C N N C C C C C C C C C N Pd N O C O N C C C O
charge: 0.079819 0.076543 0.013839 0.107975 0.015488 -0.163343 0.150805 0.141112 -0.220970 -0.221927 -0.327173 0.031932 0.005474 -0.096654 0.043999 -0.051288 -0.001627 -0.073991 0.124631 0.033721 0.006462 0.069644 -0.014867 -0.187572 0.074076 0.270932 -0.035188 -0.027171 0.233666 -0.106888 0.032965 0.048335 0.220550 0.057176 -0.029391 -0.174430 0.064306 0.258974 -0.041918 -0.140354 -0.147345 -0.168541 0.105420 -0.326542 0.027118 0.180168 0.109113 0.102673 0.059887 0.003291 0.011309 0.104520 0.102165 -0.130832 0.068065 0.229838 -0.317984 0.184087 -0.221239 -0.333851 0.185179 0.063131 0.165344 -0.302647
1716.lowfreq: -4.2711 -0.0009 -0.0006 0.0006 1.8028 2.2775 8.5698 13.9913 15.6637
redmass: 8.0441 7.6438 8.7644 8.8158 7.2000 7.8608 6.4843 6.7137 6.8725 5.1985 8.0048 5.0051 8.6211 6.1845 6.5139 5.2871 6.0757 6.8905 7.5608 6.4161 6.3286 6.3992 6.6131 5.7855 6.6910 6.7640 5.5797 5.7349 6.9180 5.3866 7.2187 4.4937 3.9946 3.4444 1.5992 4.6050 4.7305 3.6542 4.1020 3.4184 1.9560 2.6141 2.6480 3.8247 3.5795 5.2824 4.8644 4.6712 4.5767 4.9394 5.8888 7.0409 7.6361 6.3750 6.4719 6.5751 6.5333 6.6129 4.7123 5.6940 7.7217 6.9077 4.1174 5.1653 5.8115 4.3132 6.3338 8.0765 7.0097 4.2279 7.1312 5.6297 11.7832 4.7006 9.4319 4.0992 4.4902 3.3258 10.0912 4.3837 4.3397 4.0958 3.2866 4.3203 4.9033 6.6756 6.4226 6.6614 6.5677 2.7368 7.3305 3.7596 6.8705 5.0375 2.9465 5.6294 5.7344 5.7317 6.1600 5.4606 5.8302 5.2292 4.6648 5.1128 6.2065 5.1451 7.4168 7.9988 6.8009 2.3122 2.1404 6.1924 1.3527 5.3323 2.2000 2.4054 3.2913 5.5984 3.8707 2.0002 4.8313 4.2345 4.3496 4.7151 1.8746 1.9458 1.5713 2.2232 2.4708 2.2911 5.6604 2.4269 6.5665 1.8904 3.5452 3.3875 1.4191 1.4262 1.8204 1.5442 1.5962 2.7715 4.5014 1.7375 1.6178 2.1575 1.4090 2.9369 1.8060 1.8985 1.5479 1.4754 1.6786 1.4299 1.4167 1.4520 1.3624 1.4109 1.5603 1.7694 1.3681 2.4894 1.6126 2.5473 1.7049 1.6765 1.8903 1.7028 1.7438 3.4817 1.1298 1.2487 1.2916 1.3203 1.2037 1.1205 1.2473 1.2603 2.4589 2.9590 1.8439 2.3658 1.1121 4.5992 2.7234 2.4446 2.3115 3.1675 2.0351 1.6696 1.9568 1.6561 1.8942 2.0212 1.7834 3.3861 1.4033 5.1533 6.6872 4.1041 3.5135 6.7592 6.2620 3.7145 1.5995 1.6190 3.1643 4.4609 2.2176 1.3759 2.3526 1.1058 1.1158 1.1316 5.1256 1.0667 1.1492 2.5786 1.1314 5.1931 4.6928 8.5291 3.6983 3.0944 3.2986 4.9094 4.7839 5.0442 5.5327 4.3604 4.4363 4.3474 4.6817 7.6762 7.5097 7.3801 7.7935 7.8126 6.6624 7.7389 8.0167 9.0577 8.6511 8.3611 8.4549 7.5123 10.2063 12.5445 12.5716 12.8664 12.6739 12.7142 1.1063 1.0612 1.0430 1.0377 1.0382 1.1038 1.1005 1.0975 1.1021 1.1050 1.1024 1.0897 1.0901 1.0887 1.1054 1.0912 1.0931 1.0940 1.0923 1.0886 1.0889 1.0909 1.0987 1.0981 1.0985 1.0954 1.0958 1.0918 1.0976 1.0942 1.0973 1.0979 1.0977
irintensity: 0.2326 0.2394 0.2398 0.4509 0.5291 0.3346 0.4802 1.0859 0.4044 1.1013 0.3628 13.2834 0.2159 1.6755 0.1562 0.8898 0.0425 3.0222 0.1237 2.7360 1.1376 0.6601 4.0299 1.6213 2.8708 1.0358 0.1636 3.7064 0.6944 0.1255 4.1128 3.9181 2.5464 5.8858 2.4985 0.8987 0.7599 2.1065 9.5423 4.3027 6.2241 3.0266 3.0716 2.5513 1.2282 1.6159 1.1669 1.3155 2.2985 0.4031 2.9305 2.4936 2.7965 4.2965 4.5040 5.0612 1.2230 6.7267 6.1088 9.1259 15.9291 2.4408 1.8948 11.2954 7.6896 13.6349 1.0576 21.1105 3.7757 5.2122 2.3258 3.4656 11.9474 5.2200 4.5082 4.1087 0.5825 2.0787 3.5389 3.3562 0.7061 2.5325 1.7571 2.1604 0.6221 1.3804 1.0181 6.3131 2.0281 4.6358 17.0320 3.9337 1.1629 5.4863 8.6545 0.4569 1.1191 5.0736 2.1314 1.7018 1.9800 3.0422 0.4817 5.0299 1.6622 14.5341 19.1834 17.2311 0.5553 17.0857 12.4735 6.0195 11.0213 7.6149 9.0173 4.3961 9.5641 2.3181 2.1378 18.6464 4.2220 7.2133 6.1067 4.6167 28.1596 61.4700 31.6167 21.3071 12.5375 6.0210 6.7142 12.0109 33.6948 23.2255 37.0886 8.5954 0.0886 1.7202 10.6403 4.4631 10.1217 8.0660 20.4465 0.5883 0.0474 4.0805 3.6759 19.5067 6.8664 8.6096 5.5788 14.3745 10.5473 1.4749 2.6118 2.8519 1.4690 0.2249 3.2912 7.2274 0.4681 37.1218 32.6664 11.3988 3.4284 1.3893 11.9642 2.8514 2.1951 19.6057 1.5326 1.5119 10.0533 7.4202 12.9192 10.9573 4.0412 3.5746 24.6281 3.3205 3.0707 10.3176 2.1440 23.5760 3.2203 0.9846 5.3081 2.6292 29.6203 14.3070 2.1404 11.5936 8.0886 24.8787 35.2764 4.0488 21.8798 22.3555 32.9003 23.2034 12.2099 3.9935 9.2361 505.2063 7.7947 40.4933 24.0889 31.0486 16.9460 14.8215 26.1875 59.9364 10.6753 57.0724 226.5942 12.6261 8.6765 19.8656 14.3164 12.9456 10.4968 167.3065 4.4116 44.6307 6.6690 87.2247 328.4881 73.4112 51.9893 6.7713 23.3160 27.0414 85.5062 72.8629 61.3797 4.3349 33.6371 68.8673 4.7947 6.4024 56.1699 0.1216 54.0071 102.8297 38.3519 10.9979 394.8479 537.1942 411.7455 689.2408 55.6012 77.7917 552.6265 37.8869 8.6691 10.7920 5.5064 11.0830 7.2220 8.2856 5.1271 9.7526 11.3411 3.9362 1.0900 0.6642 3.4777 6.0271 5.2364 2.2356 0.7477 2.7093 1.9380 7.0550 6.2014 3.4058 3.6473 2.7934 1.7800 5.8404 0.2803 4.5109 0.0274 0.0843 2.7486
temp: 353.000 k
press: 1.00000 atm
elementType: 6 6 6 6 6 1 1 1 7 6 6 8 8 7 6 6 6 1 6 6 6 6 1 46 6 1 6 1 6 6 6 6 1 6 6 1 1 6 6 1 1 1 6 6 1 6 1 6 1 1 1 6 6 6 6 1 6 6 1 1 9 9 6 7 7 6 6 6 6 6 1 6 1 6 6 1 6 1 1 1 1 7 46 7 8 6 8 7 6 1 1 6 6 1 1 1 8
symmnumber: 1
zpe: 1891920.0 jmol-1
zpe.correction: 0.720594 hartree
zpe.thermalcorrener: 0.796267 hartree
zpe.thermalcorrenthalpy: 0.797385 hartree
zpe.thermalcorrgfe: 0.597889 hartree
zpe.sumelectzpe: -3057.313187 hartree
zpe.sumelectthermal: -3057.237515 hartree
zpe.sumelectthermalent: -3057.236397 hartree
zpe.sumelectthermalfe: -3057.435893 hartree
dipole: 2.8384 5.3107 -4.5492
dipole: 7.5469
quadrupole: -366.0956 -361.2824 -409.6798
quadrupole: -58.0918 23.8476 3.8523
quadrupole: 12.9237 17.7369 -30.6606 -58.0918 23.8476 3.8523
hfenergy: -3058.0337817 hartree
pointgroup: C01 [X(C48H33F2N7O5Pd2)]
dipole: 1.212805 2.0577466 -1.7637395 debye
polarizability: 764.7855563|-40.1088183|768.0011832|-1.7993911|-11.325615|440.5952542 unknown
InChI: InChI=1S/C35H21F2N5O2.C9H7N.C4H5NO3.2Pd/c1-20-22(24-10-3-12-28(36)26(24)18-38)8-5-14-30(20)41-34(43)32-16-7-17-33(40-32)35(44)42-31-15-6-9-23(21(31)2)25-11-4-13-29(37)27(25)19-39;1-2-6-9-8(4-1)5-3-7-10-9;1-3(6)5-2-4(7)8;;/h3-17H,1-2H3;1-7H;2H2,1H3;;/q-3;-1;-2;+2;+4
charge 0 multiplicity 1
97 atoms
C  3.83394912 3.9561639 -0.60778318
C  1.96157318 4.97270316 0.41635817
C  2.56581989 6.22492056 0.36272413
C  3.84788435 6.31500319 -0.19499683
C  4.49739662 5.17694445 -0.68951243
H  2.02240437 7.08582594 0.75533965
H  4.34605668 7.28559037 -0.24712887
H  5.49269382 5.20148265 -1.13609051
N  2.6173914 3.91261372 -0.06149664
C  4.35516923 2.61912908 -1.10264744
C  0.58541428 4.66267954 0.97570635
O  -0.12060916 5.55369866 1.42740488
O  5.46405579 2.54167417 -1.61497812
N  0.31043119 3.33167052 0.90240174
C  -0.90681791 2.8025851 1.37379388
C  -1.98840928 1.12295876 2.76347924
C  -3.29791251 2.48273633 1.24109864
H  -1.9281729 0.33927441 3.52092121
C  3.71825052 0.28744187 -1.27311179
C  4.68560986 -0.4758336 -0.58328996
C  3.0518735 -1.64864368 -2.58035588
C  4.81475521 -1.84061001 -0.91960886
H  2.41701429 -2.10262059 -3.34393434
Pd 1.73469625 2.19443039 0.01338209
C  -3.21748474 1.46776246 2.20536166
H  -4.12799539 0.95142865 2.52067234
C  4.00810351 -2.41334588 -1.91425334
H  4.12725995 -3.47445035 -2.14703081
C  -4.63119025 2.77350607 0.65288237
C  -5.23096644 4.03439881 0.73650298
C  -5.34169102 1.74295866 -0.00576394
C  -6.50010258 4.25921502 0.20070093
H  -4.69194834 4.83863948 1.24103834
C  -6.61683498 1.98862564 -0.53959619
C  -7.2071484 3.2387357 -0.440005
H  -6.95391324 5.24857417 0.28704457
H  -8.2002119 3.39294572 -0.86340197
C  -2.14568766 3.17039974 0.80481829
C  5.51989175 0.19752522 0.46914922
H  4.87237358 0.6439787 1.24297647
H  6.2213748 -0.48833891 0.95884851
H  6.09678223 1.0153987 0.0129961
C  -4.75292459 0.45012853 -0.17093651
C  2.91378706 -0.30221743 -2.2573838
H  2.16483468 0.32491371 -2.74972526
C  -0.84411507 1.79293227 2.34640178
H  0.13893267 1.53973435 2.75246325
C  -2.1961128 4.2024553 -0.2861446
H  -2.23457108 5.21880083 0.1350598
H  -1.27261885 4.16393724 -0.88508419
H  -3.0562223 4.05655328 -0.95430776
C  5.80016057 -2.73479326 -0.24764679
C  6.82743848 -3.33451207 -0.98373128
C  5.69277829 -3.04956508 1.12645988
C  7.73457354 -4.20558975 -0.37604221
H  6.91456575 -3.09872625 -2.04616986
C  6.61464234 -3.92429105 1.71742975
C  7.63833824 -4.50619312 0.98247629
H  8.5329675 -4.65563716 -0.96952237
H  8.33367932 -5.18096233 1.48312779
F  -7.2445028 1.00004816 -1.15638498
F  6.48820518 -4.20075699 3.00745225
C  4.63454084 -2.503543 1.92652832
N  3.77163497 -2.05281279 2.55926667
N  3.45001816 1.62509494 -0.90298876
C  -0.22563651 0.03807381 -0.74728699
C  1.41491021 -0.60132676 0.78022161
C  -0.83964733 1.04468432 -1.53942952
C  -0.70501078 -1.29568127 -0.83182497
C  0.98038517 -1.94485997 0.76656061
H  2.27418353 -0.31255482 1.39395465
C  -1.8631912 0.72953123 -2.40874188
H  -0.46614807 2.06842391 -1.44681422
C  -1.77932517 -1.59984789 -1.72539538
C  -0.07007041 -2.29576711 -0.04824779
H  1.50683342 -2.66624818 1.39102338
C  -2.32251384 -0.60358048 -2.51975258
H  -2.31289061 1.51451911 -3.02073539
H  -1.96887068 -2.6887207 -1.93160832
H  -0.42944172 -3.32381045 -0.131238
H  -3.12021597 -0.85093515 -3.22387319
N  0.8433761 0.34792411 0.05558792
Pd -3.51156611 -2.455039 -0.38243132
N  -4.25544873 -0.58417331 -0.3110791
O  -4.87019049 -2.93603814 0.90990924
C  -4.8392543 -4.16345654 1.39755587
O  -5.5729044 -4.53964314 2.27881046
N  -3.04550848 -4.37015598 -0.26368982
C  -3.81017045 -5.0744441 0.74767118
H  -3.17928388 -5.48117982 1.55816431
H  -4.37284479 -5.92951704 0.33537757
C  -2.24939432 -5.03932675 -1.12198027
C  -2.1313331 -6.54132582 -0.93790018
H  -1.37227836 -6.90851279 -1.63670584
H  -1.85381352 -6.8053425 0.09280891
H  -3.0916644 -7.03366799 -1.15314797
O  -1.61300154 -4.49111365 -2.03236909
