program: Gaussian 16
title: ts1c5_1BBOAIA_QRCR
version: ES64L-G16RevA.03
method: RMN15
basis: Gen
operation: Freq
keyword: #N
keyword: Geom=AllCheck
keyword: Guess=TCheck
keyword: SCRF=Check
keyword: GenChk
keyword: RMN15/ChkBas
keyword: Freq
converged: YES YES NO YES
title: Mulliken charges:
elementType: C C C C C H H H N C C O O N N C C C H C C C C H Pd C H C H C C C C H C C H H C C H C H C C C C H C C H H N C C C C C H C H C C H C H H H H C N C N Pd O C O N C H H C C H H H O C H H H C H H H F F
charge: 0.080128 0.064986 0.001105 0.092519 -0.001539 0.019910 0.020142 0.022168 -0.160557 0.147690 0.150627 -0.215468 -0.214371 -0.321074 -0.328229 0.028796 0.004594 -0.122912 -0.010026 0.038926 -0.058515 0.022729 -0.081675 -0.009844 0.113132 0.057714 -0.015757 0.045926 -0.020339 0.039071 -0.012460 -0.184378 0.062201 -0.000539 0.283646 -0.050585 0.015784 0.014455 -0.046666 0.045659 -0.017140 0.064649 -0.020279 0.080398 -0.017139 -0.168559 0.051430 -0.042187 0.255767 -0.049275 0.001674 0.006125 -0.138002 0.023827 0.134950 0.099067 0.134710 0.057637 0.031537 0.083366 0.010877 -0.002218 0.044793 -0.005270 0.043772 0.012951 0.050361 0.014412 0.053830 -0.206799 0.141481 -0.070542 0.214117 0.019506 -0.329430 0.179532 -0.226181 -0.333594 0.115249 0.035619 0.041638 0.059334 0.043999 0.028984 0.035112 0.040328 -0.303275 0.138436 0.011382 0.056800 0.011337 0.196972 -0.000547 0.054340 0.013740 -0.135910 -0.144663
chargesum: -0.00000
title: Mulliken charges with hydrogens summed into heavy atoms:
elementType: C C C C C N C C O O N N C C C C C C C Pd C C C C C C C C C C C C C C C C C N C C C C C C C C C C N C N Pd O C O N C C C O C C F F
charge: 0.080128 0.064986 0.021016 0.112662 0.020629 -0.160557 0.147690 0.150627 -0.215468 -0.214371 -0.321074 -0.328229 0.028796 -0.005432 -0.122912 0.038926 -0.058515 0.012884 -0.081675 0.113132 0.041957 0.025587 0.039071 -0.012999 -0.184378 0.077986 0.283646 -0.036131 -0.046666 0.028518 0.044370 0.080398 -0.059326 -0.168559 0.053104 0.255767 -0.043150 -0.138002 0.023827 0.166486 0.109944 0.134710 0.052367 0.096317 0.048143 0.059205 0.097603 -0.206799 0.141481 -0.070542 0.214117 0.019506 -0.329430 0.179532 -0.226181 -0.333594 0.192506 0.059334 0.148422 -0.303275 0.217955 0.264504 -0.135910 -0.144663
chargesum: 0.00000
1716.lowfreq: -0.7603 -0.0002 0.0002 0.0007 1.1850 3.4572 8.0173 13.1424 17.2627
redmass: 7.8188 9.5318 8.1162 8.0730 7.2941 6.4314 8.6081 7.1338 6.2545 7.8685 6.5652 5.3452 7.7880 7.4623 5.9568 6.8526 6.0972 4.6703 7.0149 6.4703 6.5521 7.2460 6.6605 5.4937 4.3763 6.2604 6.7120 5.7569 5.8176 5.8077 3.0262 6.1963 5.3845 3.2712 4.3896 1.5169 3.8489 1.9877 1.8163 3.8398 2.4186 4.8902 6.5214 4.5624 4.4936 6.0807 6.3420 4.7131 4.6348 7.4812 6.7807 5.3829 5.2846 5.5878 5.7994 6.4675 6.9904 6.7158 6.0280 5.0413 7.4536 6.5481 4.8883 5.5036 6.5317 4.4370 6.8571 7.4277 7.8857 7.1700 4.2846 5.3535 10.3052 5.1756 10.2459 4.0408 4.5532 10.0742 3.5875 3.8939 4.3068 5.5617 4.1971 3.4478 6.7226 6.4783 3.9147 6.6822 7.1671 2.7400 5.7701 3.7496 6.2885 4.4058 3.0617 5.2556 7.0022 6.8865 6.5086 5.8258 4.8846 4.1480 5.3772 5.2519 5.0836 6.7299 7.5864 7.9991 6.8483 2.0959 2.4520 4.0399 5.1912 2.6213 1.4699 1.9453 3.9732 6.1990 1.9956 3.8978 4.5897 4.1015 4.6157 4.6035 1.9084 1.8553 1.6284 2.1328 2.0640 2.5250 5.1416 2.3932 6.6744 1.4808 2.8355 3.3999 1.5146 1.4907 1.4504 3.6720 1.8860 1.5913 4.9134 2.3573 1.3984 1.4102 2.1291 2.9252 1.7482 1.7504 1.5393 1.4949 1.8378 1.6072 1.3719 1.5296 1.5323 1.3939 1.3646 1.3655 1.7968 2.0586 1.5433 2.5113 1.6829 1.6921 1.9992 1.7202 1.8101 3.3251 1.1946 1.1297 1.2711 1.3479 1.3684 1.1210 1.2574 1.2225 2.1434 2.4618 1.9329 1.6030 2.0982 3.0499 2.4367 2.0262 1.9604 2.5741 2.9755 1.8591 1.7067 1.9593 1.7899 2.0741 1.7116 3.3523 1.4308 5.5313 5.0928 5.4026 7.6229 4.1500 3.8239 3.1084 1.8449 4.0979 1.6775 4.6585 2.1599 4.4615 1.1079 1.0923 1.1902 1.1488 4.1023 2.2120 1.0707 1.0716 1.1262 7.3062 6.3091 4.4820 4.0133 3.5735 3.2205 3.9706 4.1949 5.7893 5.1621 4.4336 4.6201 4.6121 5.1160 6.8061 7.5761 7.7593 7.6796 7.8920 8.0771 7.4587 7.8029 9.0451 8.3894 7.5056 8.3486 8.6931 10.3953 12.7065 12.7713 12.8785 12.6757 12.7082 1.0660 1.0467 1.0393 1.0383 1.0985 1.1015 1.0943 1.1021 1.1027 1.1014 1.0894 1.0904 1.0925 1.1052 1.0923 1.0890 1.0916 1.0898 1.0890 1.0923 1.0925 1.0909 1.0938 1.0985 1.0958 1.0983 1.0970 1.0986 1.0972 1.0944 1.0973 1.0980 1.0933
irintensity: 0.1586 0.6369 0.7103 0.5347 0.3296 0.7383 0.9337 1.7796 0.9628 0.0475 4.1563 2.2382 0.8415 1.2543 3.0941 0.0202 2.3255 0.1159 6.0452 1.3739 1.6065 3.2206 0.3411 1.2039 0.2549 0.0985 3.3649 0.9004 1.5281 0.4812 0.0592 0.1445 1.4991 5.9962 0.5979 0.4373 0.6946 3.9395 0.8836 9.2435 2.0653 12.9096 0.3748 0.4967 1.6664 1.1214 0.6264 1.9349 0.4332 1.1934 7.2587 0.8080 5.3066 2.8974 3.5594 3.8673 1.2354 10.4892 12.6157 1.7672 4.4489 1.3116 2.6350 6.5549 9.5158 10.9858 4.1900 28.1570 8.7199 0.5909 1.2268 3.0512 10.9519 2.1909 4.4283 1.2928 0.2278 2.3373 0.8956 10.6145 0.3119 6.0277 1.5498 3.1081 0.7818 3.5115 1.8402 1.5508 1.9402 6.4463 1.7035 3.7324 5.4996 8.0620 2.4333 6.3385 2.5705 1.4776 8.0477 5.0225 3.5454 0.6164 0.5711 2.4819 16.1044 1.5632 21.5643 14.7572 0.8395 15.5420 4.1668 17.2574 2.8003 14.7563 2.5083 13.4999 5.9083 0.5954 23.0508 9.2140 2.3051 4.5914 2.5417 6.5182 22.3317 46.1795 8.4053 12.2966 30.9238 8.8115 12.0801 11.9649 32.6718 0.7222 46.0039 6.7022 13.4818 0.3636 0.1746 3.0077 8.7868 4.9952 30.1087 2.8395 0.2910 0.0868 8.3403 28.1995 2.5736 3.4904 2.1124 1.9794 6.4277 4.9801 0.6140 1.7905 3.1063 1.4020 1.1231 12.3797 8.1715 12.9125 5.3858 2.0952 1.1681 4.2623 0.9626 1.8281 6.4201 21.5383 30.2184 1.7393 7.5188 12.6047 4.4429 0.8763 1.0749 1.1236 27.5881 2.4697 4.8410 2.9742 28.7697 1.8350 8.5066 6.9632 1.9003 3.0815 5.5493 2.2780 4.8910 0.2894 16.9311 9.4802 37.4660 18.3737 47.2219 22.2492 36.7412 1.7779 8.0471 49.0618 673.0079 2.4958 2.2508 8.2615 26.9665 40.5581 5.8043 40.4234 26.7246 47.8339 9.2463 72.8475 276.4388 3.5758 21.9961 19.2965 7.9708 176.8422 44.2350 5.0541 17.5426 29.0761 1.1369 206.0428 226.7838 27.2037 77.9199 1.1473 4.8486 25.4973 39.3330 21.0384 71.5080 89.4147 59.0674 18.4266 39.4403 6.2307 30.6447 0.2528 25.1886 13.7228 80.4470 49.9407 338.1713 524.9072 448.9761 764.7615 14.3429 91.9544 44.2392 11.2641 13.5349 6.4041 10.5801 12.5784 9.9374 6.1915 5.6051 12.9920 2.5199 7.4744 41.0924 4.2680 1.3555 0.9760 4.6183 1.2272 1.6330 0.0770 5.6033 6.6677 5.9796 2.8470 2.1341 4.4070 0.7679 0.5543 0.1781 5.6627 0.0581 0.3693 11.9511
temp: 353.000 k
press: 1.00000 atm
elementType: 6 6 6 6 6 1 1 1 7 6 6 8 8 7 7 6 6 6 1 6 6 6 6 1 46 6 1 6 1 6 6 6 6 1 6 6 1 1 6 6 1 6 1 6 6 6 6 1 6 6 1 1 7 6 6 6 6 6 1 6 1 6 6 1 6 1 1 1 1 6 7 6 7 46 8 6 8 7 6 1 1 6 6 1 1 1 8 6 1 1 1 6 1 1 1 9 9
symmnumber: 1
zpe: 1893292.4 jmol-1
zpe.correction: 0.721117 hartree
zpe.thermalcorrener: 0.796783 hartree
zpe.thermalcorrenthalpy: 0.797901 hartree
zpe.thermalcorrgfe: 0.598608 hartree
zpe.sumelectzpe: -3057.308386 hartree
zpe.sumelectthermal: -3057.232720 hartree
zpe.sumelectthermalent: -3057.231602 hartree
zpe.sumelectthermalfe: -3057.430895 hartree
dipole: -2.3133 -5.1742 7.9649
dipole: 9.7757
quadrupole: -472.4578 -400.1551 -344.2596
quadrupole: 22.5388 -28.3903 21.8801
quadrupole: -66.8337 5.4691 61.3646 22.5388 -28.3903 21.8801
hfenergy: -3058.0295033 hartree
pointgroup: C01 [X(C48H33F2N7O5Pd2)]
dipole: -1.0330892 -2.007782 3.113446 debye
polarizability: 721.4032491|7.6395396|659.4830396|-12.4671794|12.3372263|588.2979307 unknown
InChI: InChI=1S/C35H21F2N5O2.C9H7N.C4H5NO3.2Pd/c1-20-22(24-10-3-12-28(36)26(24)18-38)8-5-14-30(20)41-34(43)32-16-7-17-33(40-32)35(44)42-31-15-6-9-23(21(31)2)25-11-4-13-29(37)27(25)19-39;1-2-6-9-8(4-1)5-3-7-10-9;1-3(6)5-2-4(7)8;;/h3-17H,1-2H3;1-7H;2H2,1H3;;/q-3;-1;-2;+2;+4
charge 0 multiplicity 1
97 atoms
C  -4.74592573 -2.31827084 -1.4507724
C  -3.35551443 -4.20301221 -1.18347234
C  -4.36982396 -5.05824677 -1.60288612
C  -5.60623221 -4.49766044 -1.94519139
C  -5.8067327 -3.11375482 -1.87150201
H  -4.16172946 -6.12833067 -1.65007064
H  -6.42102451 -5.14534565 -2.27594419
H  -6.74911436 -2.62858047 -2.13093156
N  -3.58433674 -2.89027043 -1.12577211
C  -4.76331154 -0.80978276 -1.32951173
C  -1.9573752 -4.61677323 -0.78231965
O  -1.61954954 -5.78884839 -0.85130748
O  -5.78216856 -0.18012885 -1.57603406
N  -3.55344501 -0.32465607 -0.94146113
N  -1.21744624 -3.55069048 -0.35633526
C  0.1347456 -3.7576878 -0.01264165
C  2.35872616 -4.50824719 -0.66078462
C  2.01915112 -3.41410676 1.46294068
H  3.01812365 -4.98755777 -1.38702269
C  -3.36152938 1.06917764 -0.78800177
C  -3.92663366 1.75353945 0.31140764
C  -2.2176785 3.0822584 -1.51271411
C  -3.59026396 3.11174103 0.49349723
H  -1.5640806 3.59782342 -2.21944968
Pd -2.14094667 -1.73376909 -0.55139805
C  2.87841878 -4.00572297 0.53306475
H  3.94765547 -4.07104835 0.7486802
C  -2.75409327 3.76652919 -0.42481647
H  -2.5126623 4.82061393 -0.26688821
C  2.58674975 -2.83682115 2.7134026
C  2.57357414 -3.50218234 3.94035881
C  3.1527858 -1.5448895 2.65765278
C  3.11309292 -2.89864022 5.08011633
H  2.14050018 -4.50291273 3.99464558
C  3.68515694 -0.95059383 3.81216332
C  3.67093145 -1.61994703 5.02733827
H  3.10185121 -3.43515005 6.03108343
H  4.09816532 -1.13391709 5.90519266
C  0.63680352 -3.29040288 1.21841703
C  -2.51444622 1.73234424 -1.68354525
H  -2.09193331 1.15821612 -2.51305503
C  1.00077749 -4.38247367 -0.92712649
H  0.57908206 -4.76382424 -1.85894896
C  -4.03685784 3.87667341 1.69120353
C  -3.70389711 3.43503635 2.97944374
C  -4.7463671 5.09123531 1.56508135
C  -4.06237592 4.16541183 4.11209816
H  -3.15240085 2.49670663 3.08260944
C  -5.0960433 5.81067515 2.71864251
C  -4.76414862 5.36493229 3.99009275
H  -3.78893554 3.80010396 5.10401286
H  -5.05896701 5.96099437 4.85452419
N  -0.71286681 -0.35100596 0.02381175
C  0.32329692 -0.00322971 -0.79450828
C  -1.03712541 0.44076248 1.04313812
C  0.71831566 -0.88603119 -1.85100196
C  0.99036852 1.23851626 -0.62809929
C  -0.38076743 1.6521234 1.31125767
H  -1.88165352 0.11372049 1.65778836
C  1.70596238 -0.52046942 -2.72128958
H  0.20440465 -1.84611388 -1.93781894
C  1.9947573 1.63326387 -1.58393126
C  0.61527141 2.06669336 0.4485547
H  -0.70228032 2.2644403 2.15459937
C  2.32852067 0.77193791 -2.62730294
H  1.99698831 -1.19242072 -3.53069651
H  2.34934223 2.66708304 -1.63246192
H  1.11925373 3.02680901 0.58310099
H  2.91685457 1.16391593 -3.45761563
C  -5.14103073 5.61815413 0.28772568
N  -5.46300853 6.06311541 -0.7342649
C  3.21056453 -0.84604135 1.4117182
N  3.29259027 -0.28405472 0.40372851
Pd 4.08549705 0.7522261 -1.14528487
O  5.79804876 0.23430756 -0.37189919
C  6.87631221 0.46670722 -1.09672376
O  7.97401843 0.05599556 -0.80647856
N  5.23612663 1.72972064 -2.41495711
C  6.62135413 1.3035131 -2.34169782
H  7.32077688 2.15307487 -2.28934927
H  6.93292927 0.69772206 -3.21257007
C  4.87087609 2.81547725 -3.13615796
C  5.94989116 3.48890851 -3.96874844
H  6.51024063 2.76946374 -4.58292659
H  5.45817394 4.22829531 -4.61017911
H  6.67498997 4.00425483 -3.32039302
O  3.7234697 3.26806181 -3.15501983
C  -4.85877448 0.99735102 1.21703303
H  -5.23213703 1.60404036 2.04947851
H  -5.72144695 0.6479865 0.62996561
H  -4.36842799 0.09489328 1.62328749
C  -0.26111287 -2.69849461 2.27333766
H  0.09355459 -1.70708693 2.59878433
H  -1.29317081 -2.60331481 1.91011013
H  -0.27623071 -3.33631591 3.17123529
F  4.2006831 0.26332319 3.72320544
F  -5.76471534 6.94500171 2.57719317
