program: Gaussian 16
title: Title Card Required
version: ES64L-G16RevA.03
method: RMN15
basis: Gen
operation: Freq
keyword: #N
keyword: Geom=AllCheck
keyword: Guess=TCheck
keyword: SCRF=Check
keyword: GenChk
keyword: RMN15/ChkBas
keyword: Freq
converged: YES YES YES YES
title: Mulliken charges:
elementType: C C C C C H H H N C C O O N N C C C H C C C C H Pd C H C H C C C H C C H H C C H H H C H C H C H H H C C C H C C H H F F C C C C N N N C C C C C H C H C C H C H H H H
charge: 0.063588 0.078732 -0.002867 0.092283 0.001554 0.020744 0.019232 0.020329 -0.161753 0.152900 0.151364 -0.217133 -0.212774 -0.318413 -0.320463 0.026939 0.008543 -0.082055 -0.016852 0.025140 -0.070391 0.004159 -0.063701 -0.017701 0.132079 0.053875 -0.023050 0.048872 -0.024400 0.081868 -0.018909 0.050901 -0.039986 0.255431 -0.049567 0.002509 0.006006 -0.059322 0.183916 -0.002374 0.035756 0.016975 0.052718 -0.022615 0.059091 -0.011160 0.132195 0.012458 0.057907 0.015104 0.097525 0.007981 0.066376 -0.086723 0.256286 -0.053848 -0.013909 0.002658 -0.145158 -0.147167 -0.168855 -0.174881 -0.213279 -0.206489 0.139700 0.139094 -0.134126 0.014977 0.129203 0.100972 0.091915 0.062846 0.032327 0.025416 0.016385 -0.026856 0.030647 -0.008143 0.054352 0.000909 -0.017665 -0.001548 0.001396
chargesum: -0.00000
title: Mulliken charges with hydrogens summed into heavy atoms:
elementType: C C C C C N C C O O N N C C C C C C C Pd C C C C C C C C C C C C C C C C C F F C C C C N N N C C C C C C C C C
charge: 0.063588 0.078732 0.017876 0.111515 0.021883 -0.161753 0.152900 0.151364 -0.217133 -0.212774 -0.318413 -0.320463 0.026939 -0.008310 -0.082055 0.025140 -0.070391 -0.013542 -0.063701 0.132079 0.030825 0.024472 0.081868 -0.058895 0.053410 0.255431 -0.043561 -0.059322 0.234273 0.030102 0.047931 0.217664 0.097525 -0.078742 0.052467 0.256286 -0.051189 -0.145158 -0.147167 -0.168855 -0.174881 -0.213279 -0.206489 0.139700 0.139094 -0.134126 0.014977 0.161530 0.117358 0.091915 0.054704 0.026325 -0.044521 0.029099 0.055748
1716.lowfreq: -2.3443 -1.2452 -0.0007 -0.0004 0.0009 3.9577 11.7205 14.8770 19.2802
frequency: 11.7059 14.8759 19.2686 24.6346 31.3335 35.9455 39.1928 43.1959 55.0203 59.5764 64.1990 70.2088 74.8242 83.8262 93.3247 99.2663 110.0857 114.3385 120.5155 130.5031 135.2748 139.5136 147.7399 150.9903 155.8623 167.9521 170.2843 180.8257 197.4165 198.9336 200.4456 203.5975 208.4397 224.2473 247.7300 253.2844 255.6912 260.9306 262.2483 277.1365 284.6736 287.7524 292.6831 299.1192 304.8306 326.0697 334.2342 342.2195 366.6035 378.9974 398.3863 402.5690 406.6159 409.1230 429.4533 433.0125 443.4878 446.6741 462.4559 463.3070 471.2210 479.1582 487.2860 499.7116 513.7372 517.8691 520.8266 522.6141 525.8931 531.8442 542.6786 551.3473 560.1135 573.5721 583.1465 590.5599 592.6416 593.2152 601.7193 632.2234 634.3148 638.3827 649.4206 657.1875 659.6544 665.8727 667.5236 694.9524 701.9950 739.3709 744.1013 752.0908 762.1167 768.7111 775.0231 775.8666 786.9216 790.3262 791.7031 801.9249 804.3276 804.4833 810.7725 813.0370 815.0045 822.3513 832.2568 840.1845 844.8173 859.6251 868.5082 885.3325 907.8394 924.7345 936.6705 939.3410 944.4286 947.6248 949.4034 954.8638 969.9230 977.2995 987.3993 999.6230 1009.0960 1018.6094 1024.0482 1026.4058 1027.6136 1028.9316 1032.0548 1032.7115 1046.7483 1047.9191 1049.8509 1055.0868 1056.4033 1066.6396 1077.2971 1079.0253 1083.0427 1096.4598 1100.5055 1105.8955 1129.2853 1132.5592 1134.3291 1136.4366 1146.6828 1151.5161 1158.9559 1161.0414 1171.5865 1174.4148 1205.2875 1211.8939 1215.9360 1218.6597 1220.2458 1221.9130 1240.2524 1253.0916 1263.8877 1269.1345 1280.9437 1290.5913 1311.1884 1346.0656 1352.3040 1353.2037 1356.6038 1358.3657 1359.7552 1371.2733 1375.0847 1376.3027 1382.8400 1403.4566 1407.5788 1413.5856 1421.3705 1426.3128 1431.5478 1443.6340 1451.1240 1475.9812 1482.3489 1486.3686 1488.1217 1500.7732 1504.4377 1505.8936 1525.9072 1527.0127 1527.4564 1535.4190 1536.3752 1573.8368 1657.0482 1658.1875 1664.8688 1666.9577 1667.5284 1669.6420 1670.4863 1671.1319 1680.7263 1691.0599 1691.9996 1692.5985 1708.7194 1804.0221 1814.2195 2406.4011 2407.6747 3053.5123 3084.2796 3147.5285 3164.6991 3188.5223 3209.3501 3218.0380 3220.1820 3227.3203 3227.7928 3228.2349 3230.1890 3231.4774 3233.2107 3236.5760 3239.4219 3243.9693 3245.7029 3246.5647 3246.8999 3247.7927 3250.3711 3256.6114 3260.7640 3263.5650 3265.2722 3266.6310 3269.0194
redmass: 8.5338 8.9347 7.9889 7.3327 6.3467 6.6381 6.9762 6.2378 7.4899 7.7802 8.1103 5.6576 8.4937 5.6719 5.4617 5.0224 7.2429 5.3355 7.4693 3.3286 3.9313 5.5649 3.6857 3.0446 2.6237 2.9041 5.0188 6.2717 3.7545 3.8788 2.6051 3.6134 7.0673 6.5949 5.4058 6.2559 5.8861 5.3253 4.3925 5.7234 5.6242 5.8863 4.8474 5.8064 5.2743 5.7597 5.0676 7.6920 4.5791 5.8533 6.1539 4.2757 6.7351 6.5864 4.0520 7.1032 5.0488 5.1076 10.2964 10.1972 3.9888 4.6427 3.1770 3.9285 4.7471 6.3049 3.6973 3.9646 3.5295 5.9951 6.1930 6.7161 7.4051 6.3744 5.6812 5.3844 5.4765 5.7735 6.6501 6.1482 6.8348 5.7134 3.5192 5.5142 5.5544 5.4483 7.1757 7.7635 6.8922 2.7871 2.0881 2.9264 1.2424 4.9831 2.0079 2.0107 6.6853 1.8938 4.3412 4.6830 4.3286 4.4641 2.4919 3.3546 1.8946 2.0178 1.5843 2.6245 2.5053 4.7333 2.4151 6.7076 1.7062 2.5245 1.5083 1.4438 1.5153 1.8252 1.6137 5.5822 2.4387 1.4036 1.3876 3.0916 1.3443 1.5091 1.5089 1.5904 1.3945 1.4704 1.4640 1.3775 1.4961 1.7667 1.8296 1.4447 2.1944 2.4904 1.6978 1.6899 2.0072 1.7262 1.7926 3.3210 1.1295 1.3196 1.3914 1.3519 1.2104 1.0943 1.2558 1.2513 2.0656 2.5138 1.8853 2.4102 3.2796 2.6470 2.3264 2.5416 2.0660 1.7706 1.9721 1.5940 1.7605 2.0818 3.4406 5.4567 4.5090 6.3934 7.0423 6.9420 4.1256 1.7325 1.9810 2.1040 3.7830 4.2858 2.0645 1.1153 1.0996 1.4624 2.4287 3.0891 1.1366 4.1125 4.9689 3.7709 3.4940 3.7727 3.3031 4.2696 5.0173 4.4864 4.8642 4.6356 4.9471 4.7289 7.5472 7.5122 7.9454 7.7142 7.8147 7.9234 7.8418 6.6804 9.0175 8.3985 8.3898 8.6809 7.2882 12.6069 12.7916 12.6761 12.6759 1.0477 1.0379 1.0928 1.0995 1.1047 1.1017 1.0895 1.0904 1.0874 1.0915 1.0915 1.0886 1.0882 1.0925 1.0904 1.0932 1.0909 1.0933 1.0962 1.0988 1.0945 1.0990 1.0999 1.0985 1.0967 1.0972 1.0942 1.0981
irintensity: 1.0887 1.8093 0.3325 0.1418 1.1559 1.1939 1.3653 0.6883 0.7332 0.0152 0.6015 1.1976 1.3386 2.9696 2.3330 0.9522 2.0139 0.4976 0.7817 0.2132 1.0784 1.3792 4.7523 0.1720 0.6739 0.3840 2.2408 0.0693 0.1659 0.5004 0.3884 1.4555 2.9829 1.7454 1.2753 1.2091 1.6887 3.3949 0.8320 0.8243 8.4463 2.5400 2.6178 1.8477 7.6765 13.8734 8.1628 2.3327 5.7089 4.1841 9.1129 4.0557 1.5473 2.8541 1.9559 3.2654 1.8572 4.3555 4.9909 4.6535 2.1929 2.9293 3.1487 3.5696 1.7265 1.1550 2.3995 0.5034 3.5177 1.6752 3.4309 0.6995 3.8315 1.4741 1.8165 3.4600 4.1658 3.7199 2.6616 6.2145 2.6883 2.4232 1.6872 6.3002 1.0589 1.3242 12.8575 16.6644 2.0007 5.5725 3.0852 30.2202 4.8433 2.1046 11.3544 10.8312 0.5430 21.5337 5.4125 1.8391 1.8067 4.3760 28.2779 17.6710 22.6107 22.5772 25.7070 16.6021 0.5873 12.3487 11.7247 58.0221 0.2189 39.0795 11.3631 1.2202 6.7716 16.7926 8.6075 1.4226 3.1978 0.0858 0.6877 32.6918 2.7740 2.1856 3.5579 1.9720 1.5338 0.6830 1.4699 1.2321 1.2973 8.2783 1.4950 1.6294 3.1092 3.1406 4.0046 2.4230 1.0602 2.0299 5.5880 19.3704 2.0719 10.0020 9.0131 12.7610 3.0453 0.8238 2.4396 1.7736 20.0968 12.0836 3.4748 10.8224 0.2530 0.9611 2.0458 1.8469 7.4744 1.6848 0.2309 2.0661 3.8650 44.4067 8.4928 39.4768 43.7829 8.2685 16.1927 4.3503 31.8398 5.4642 26.9288 10.9550 20.2401 44.3850 2.7337 24.5565 7.3243 74.8333 198.1630 11.9960 9.6067 5.9743 11.1021 6.1917 25.3751 193.4174 5.2725 332.9347 68.7196 7.6870 25.1086 4.0063 4.2916 43.9128 99.7123 111.3019 12.4151 57.9174 30.5350 24.8034 37.1624 4.9886 0.6424 28.8598 21.4612 55.0618 12.1384 515.2850 438.2877 17.3519 15.4481 11.5222 11.5949 11.3954 10.7036 8.4114 11.9876 2.6365 7.3658 2.9721 0.2011 4.8578 0.7605 4.2913 1.1150 2.2431 6.0892 6.7041 5.0292 1.6987 6.4502 1.8274 4.9515 5.8790 0.6893 0.3632 0.1762 5.5523 0.2060
temp: 353.000 k
press: 1.00000 atm
elementType: 6 6 6 6 6 1 1 1 7 6 6 8 8 7 7 6 6 6 1 6 6 6 6 1 46 6 1 6 1 6 6 6 1 6 6 1 1 6 6 1 1 1 6 1 6 1 6 1 1 1 6 6 6 1 6 6 1 1 9 9 6 6 6 6 7 7 7 6 6 6 6 6 1 6 1 6 6 1 6 1 1 1 1
symmnumber: 1
zpe: 1636052.6 jmol-1
zpe.correction: 0.623140 hartree
zpe.thermalcorrener: 0.685530 hartree
zpe.thermalcorrenthalpy: 0.686647 hartree
zpe.thermalcorrgfe: 0.516986 hartree
zpe.sumelectzpe: -2494.631196 hartree
zpe.sumelectthermal: -2494.568806 hartree
zpe.sumelectthermalent: -2494.567688 hartree
zpe.sumelectthermalfe: -2494.737350 hartree
dipole: 1.4666 4.7845 -0.0246
dipole: 5.0043
quadrupole: -448.1951 -281.8330 -305.2975
quadrupole: 11.4229 -47.5511 2.5729
quadrupole: -103.0865 63.2755 39.8110 11.4229 -47.5511 2.5729
hfenergy: -2495.2543356 hartree
pointgroup: C01 [X(C44H28F2N6O2Pd1)]
dipole: -0.5026731 -1.8843975 0.2696886 debye
polarizability: 599.4717605|42.6389277|602.819748|61.0489712|-26.4496522|443.00401 unknown
InChI: InChI=1S/C35H21F2N5O2.C9H7N.Pd/c1-20-22(24-10-3-12-28(36)26(24)18-38)8-5-14-30(20)41-34(43)32-16-7-17-33(40-32)35(44)42-31-15-6-9-23(21(31)2)25-11-4-13-29(37)27(25)19-39;1-2-6-9-8(4-1)5-3-7-10-9;/h3-17H,1-2H3;1-7H;/q-3;-1;+4
charge 0 multiplicity 1
83 atoms
C  1.13186272 4.21435543 -1.10322738
C  -1.20670648 3.93865968 -1.24093789
C  -1.34416473 5.13576979 -1.93596626
C  -0.1883107 5.87837563 -2.20835061
C  1.06713192 5.4251429 -1.78620253
H  -2.34505006 5.45226463 -2.23400002
H  -0.26828671 6.82382001 -2.74924896
H  1.99391864 5.97384095 -1.96138962
N  0.00971162 3.53271511 -0.86779808
C  2.38599805 3.57538034 -0.54576899
C  -2.33885824 3.02588126 -0.81686229
O  -3.4960627 3.29934892 -1.1038187
O  3.45696082 4.15786101 -0.61681332
N  2.12758172 2.34749812 -0.00797499
N  -1.88131524 1.96023312 -0.10714607
C  -2.76761111 1.00003293 0.43400809
C  -3.59523644 -0.13057749 2.41639415
C  -4.15175517 -0.9750372 0.20650762
H  -3.66478393 -0.20692063 3.50330651
C  3.14839049 1.64638698 0.66742326
C  3.37224771 0.2927366 0.34227387
C  4.751346 1.5088082 2.48117488
C  4.20930061 -0.46920495 1.18611151
H  5.30966002 1.98537477 3.28966067
Pd 0.13909609 1.85911581 0.09759164
C  -4.23819583 -1.06241852 1.60463104
H  -4.80272658 -1.88396103 2.05252202
C  4.89210936 0.14166308 2.24729383
H  5.53741368 -0.46234072 2.88926597
C  -4.76711452 -2.07014878 -0.59418455
C  -3.97754499 -2.85402339 -1.44731375
C  -4.52113095 -3.92029127 -2.16305851
H  -2.91576542 -2.61196849 -1.54416573
C  -6.66246429 -3.4702521 -1.19911094
C  -5.87428945 -4.23858929 -2.04390048
H  -3.88384542 -4.51536364 -2.82024345
H  -6.33108048 -5.06558591 -2.58875529
C  -3.43316197 0.07682463 -0.4025943
C  2.78773723 -0.25970994 -0.93285233
H  1.76076448 -0.6384096 -0.81668249
H  2.73994722 0.53704733 -1.68818161
H  3.39878585 -1.08495469 -1.32327237
C  3.8739591 2.25562693 1.701963
H  3.72232537 3.32070809 1.8885361
C  -2.85550586 0.89072927 1.82766781
H  -2.30881698 1.6187723 2.43386924
C  -3.32508939 0.258673 -1.89099648
H  -3.87468363 -0.5022654 -2.45613192
H  -3.72381212 1.24796864 -2.16038937
H  -2.26828052 0.24886343 -2.21320405
C  4.33069371 -1.93889292 0.9979364
C  3.17038784 -2.723684 0.93827922
C  3.2370311 -4.10926174 0.80796736
H  2.20311369 -2.22205768 1.00871756
C  5.62440387 -3.98788417 0.78811226
C  4.4710437 -4.75704718 0.73265176
H  2.31599062 -4.69537173 0.77046072
H  4.56046625 -5.83931318 0.63146634
F  -7.95033467 -3.75160772 -1.07045485
F  6.80808106 -4.57901271 0.71097483
C  -6.13671241 -2.39174811 -0.47037595
C  5.58159352 -2.59037828 0.91796916
C  6.82796605 -1.87534857 0.93847115
C  -7.0259934 -1.64200824 0.37351355
N  -7.7580002 -1.05443913 1.05552251
N  7.84706327 -1.32071438 0.95432591
N  0.11196076 0.05729339 1.10650929
C  0.51003078 -0.08140572 2.41199023
C  -0.47379209 -0.95718259 0.48701883
C  1.10297514 1.01067362 3.09441818
C  0.31794325 -1.31678668 3.09885488
C  -0.72643321 -2.198894 1.10603391
H  -0.77595636 -0.78001561 -0.54974359
C  1.53319675 0.85747143 4.39225765
H  1.21777605 1.95668103 2.56092227
C  0.76757531 -1.43843315 4.44174664
C  -0.32970705 -2.37424259 2.4121493
H  -1.23960061 -2.98190105 0.54628878
C  1.37180192 -0.3767388 5.07230411
H  2.00767297 1.69731746 4.90376636
H  0.62208836 -2.39062462 4.9573763
H  -0.50626037 -3.31826804 2.934136
H  1.72236502 -0.47621627 6.1012277
