program: Gaussian 16
title: Title Card Required
version: ES64L-G16RevA.03
method: RMN15
basis: Gen
operation: Freq
keyword: #N
keyword: Geom=AllCheck
keyword: Guess=TCheck
keyword: SCRF=Check
keyword: GenChk
keyword: RMN15/ChkBas
keyword: Freq
converged: YES YES YES YES
title: Mulliken charges:
elementType: C C C C C H H H N C C O O N N C C C H C C C C H Pd C H C H C C C H C C H H C C H H H C H C H C H H H C C C H C C H H F F C C C C N N N C C C C C H C H C C H C H H H H
charge: 0.065967 0.065031 0.002840 0.091770 0.000590 0.020521 0.019473 0.020756 -0.163294 0.155664 0.153227 -0.212408 -0.209940 -0.323566 -0.319610 0.020923 0.000955 -0.064225 -0.017272 0.030967 -0.072636 -0.002103 -0.060028 -0.014225 0.127862 0.047698 -0.023946 0.043239 -0.021197 0.104195 0.002808 0.065667 -0.085396 0.256386 -0.053263 -0.012293 0.003513 -0.065542 0.182321 0.015739 0.019453 0.032944 0.045292 -0.021759 0.053512 -0.021605 0.175644 0.018184 0.037610 0.007790 0.116254 -0.002945 0.067028 -0.077872 0.256833 -0.051400 -0.013469 0.003543 -0.146837 -0.146854 -0.175198 -0.178899 -0.217553 -0.215240 0.138723 0.137948 -0.125386 -0.020552 0.118458 0.113195 0.102233 0.063305 0.063321 0.021344 0.012535 -0.035093 0.021522 0.006600 0.051934 0.001554 -0.015627 0.000613 0.001747
chargesum: -0.00000
title: Mulliken charges with hydrogens summed into heavy atoms:
elementType: C C C C C N C C O O N N C C C C C C C Pd C C C C C C C C C C C C C C C C C F F C C C C N N N C C C C C C C C C
charge: 0.065967 0.065031 0.023361 0.111243 0.021346 -0.163294 0.155664 0.153227 -0.212408 -0.209940 -0.323566 -0.319610 0.020923 -0.016317 -0.064225 0.030967 -0.072636 -0.016328 -0.060028 0.127862 0.023752 0.022043 0.104195 -0.082587 0.053374 0.256386 -0.049750 -0.065542 0.250458 0.023533 0.031907 0.239227 0.116254 -0.080817 0.053559 0.256833 -0.047857 -0.146837 -0.146854 -0.175198 -0.178899 -0.217553 -0.215240 0.138723 0.137948 -0.125386 -0.020552 0.181778 0.125730 0.102233 0.069905 0.022898 -0.050720 0.022134 0.053681
1716.lowfreq: -0.0007 -0.0002 0.0007 1.5558 3.4154 3.9761 13.8256 16.5021 22.4885
frequency: 13.7984 16.4994 22.4717 27.3617 30.9883 37.0585 42.0896 52.2662 58.5171 62.0563 66.7567 75.9068 79.5595 86.3162 88.1712 98.7038 107.6245 117.2455 124.9326 132.6147 138.4583 144.3426 151.1346 156.8028 157.4166 174.8426 182.4667 184.3801 193.6794 199.3310 204.7617 209.7397 212.6197 222.4462 246.7513 255.1405 257.4999 260.1731 261.5984 278.6491 282.5593 287.0306 294.3730 298.4568 301.3471 324.3377 327.1593 341.7944 368.2994 388.3481 394.6154 403.0855 406.9988 409.3548 430.7743 433.2047 444.8153 446.2572 463.0024 463.3959 471.3268 486.4435 487.3709 498.8655 509.9535 518.0039 519.1841 525.2631 529.3562 532.8274 535.0838 556.5024 560.1934 572.4307 574.3829 591.6209 592.9897 596.4514 602.7427 630.6426 633.0309 635.3190 646.3791 656.7946 663.6945 665.2295 669.7490 694.2712 701.6562 740.1196 744.4747 751.0366 764.7719 767.9352 776.7846 778.5786 786.0020 790.2084 794.6452 801.9739 804.3768 804.6170 809.4167 811.0122 814.6351 820.9144 834.7699 842.3489 846.3330 860.0514 868.5340 886.0393 906.8093 926.7042 936.6475 941.4931 945.3794 948.1325 948.8145 953.4181 969.9955 977.3989 986.0588 998.8193 1010.1254 1018.1641 1022.0430 1025.9318 1028.2499 1029.7670 1032.5490 1034.3195 1043.9400 1047.0992 1048.2426 1055.2128 1055.9272 1057.4795 1079.2094 1079.9784 1084.0703 1096.8821 1100.4040 1105.4090 1129.4945 1131.8888 1134.4084 1134.4975 1145.5909 1149.8305 1160.7728 1161.1573 1171.0752 1171.9368 1209.1526 1213.0612 1217.1655 1219.1931 1221.0670 1222.8819 1239.6804 1254.3997 1266.4069 1268.4441 1281.4582 1290.1652 1311.5881 1346.6519 1351.5634 1352.9124 1356.6349 1358.2990 1359.7707 1371.2987 1376.1255 1376.7292 1382.7899 1401.1290 1407.5515 1418.1426 1421.7614 1425.7566 1427.1467 1429.8887 1442.3411 1475.6051 1480.5758 1485.2712 1485.8863 1500.3853 1504.0895 1504.8634 1525.5280 1526.3271 1527.3904 1533.8503 1535.6429 1573.0619 1655.0624 1657.2282 1664.0159 1665.5205 1666.4358 1669.1273 1669.3401 1671.1181 1679.5371 1690.6382 1691.8898 1692.6175 1708.6066 1811.0669 1821.1138 2405.4605 2406.1519 3076.3140 3083.3444 3156.9515 3162.8850 3189.9581 3194.7177 3227.4859 3227.5171 3230.2162 3232.6366 3233.7649 3235.3382 3235.8382 3236.7766 3239.7881 3243.1518 3243.9026 3245.7596 3248.5980 3250.0041 3250.1008 3255.7269 3258.5459 3264.1094 3264.3062 3266.2930 3268.8902 3270.8795
redmass: 9.4676 8.3483 7.3161 7.5016 7.0978 6.9247 6.7784 7.1833 8.0389 7.3794 6.9514 8.5584 6.9687 6.7616 7.8765 5.0713 5.4729 5.2386 6.2273 3.7926 5.4846 7.2475 2.5867 2.2647 5.2797 6.2550 3.8522 4.6617 2.9797 4.1145 2.8098 2.5171 5.2580 4.4474 5.7784 5.7425 5.8044 5.1772 4.4924 5.9910 6.2020 5.8884 4.8379 5.2250 5.3593 6.0385 5.8201 9.4032 4.0458 9.1376 4.0931 4.3274 6.5047 6.7040 4.4985 7.4407 4.8507 5.0587 10.3476 10.2661 3.9550 3.9388 3.5778 4.1946 3.9703 6.8637 3.8941 3.7228 5.2075 4.5211 5.7188 6.5698 7.4090 6.5063 6.0078 4.9141 5.1266 6.2765 6.6186 6.2882 6.9026 5.9803 3.4382 6.1255 5.8482 5.4562 6.0718 7.7848 6.8252 2.8668 2.0345 2.7630 1.3414 3.6405 2.0202 2.1052 7.0800 1.8996 4.3716 4.5962 4.4328 4.3166 2.4234 4.0980 1.8742 2.0303 1.5624 2.7091 2.5008 4.6755 2.3987 7.0019 1.6188 2.2494 1.4446 1.5446 1.5114 1.6974 1.6571 5.5189 2.7104 1.3989 1.3854 3.1218 1.3376 1.4898 1.5652 1.5771 1.6027 1.4984 1.3541 1.3533 1.3899 1.9530 1.8036 1.4662 2.1005 2.3694 1.6912 1.6932 2.0382 1.7429 1.7912 3.2987 1.1294 1.3046 1.4307 1.4672 1.2050 1.0904 1.2538 1.2572 2.0413 2.2068 1.9116 2.5682 2.8290 2.5728 2.3523 2.8379 2.0719 1.7812 1.9235 1.6198 1.7328 2.0836 3.4398 4.9668 4.8301 6.3780 8.4460 7.9061 3.9425 1.7502 2.2897 1.7720 3.3663 4.1994 2.0792 1.6499 1.1092 1.2870 1.0738 1.6873 3.1210 4.0690 4.9779 3.9972 3.7596 3.7386 3.3121 4.1206 5.0693 4.4758 4.9919 4.4672 4.8302 4.7338 7.6053 7.4933 7.9088 7.6948 7.7690 7.8887 7.9604 6.5005 8.9694 8.3888 8.3905 8.6710 7.3436 12.9026 12.8752 12.6765 12.6762 1.0406 1.0383 1.0966 1.0992 1.1048 1.1048 1.0871 1.0872 1.0882 1.0885 1.0918 1.0895 1.0910 1.0931 1.0933 1.0932 1.0909 1.0960 1.0996 1.0958 1.0975 1.0998 1.0929 1.0968 1.0972 1.0944 1.0979 1.0982
irintensity: 1.1444 1.8179 0.4853 0.3482 1.3514 0.8891 0.3900 0.8174 1.5844 0.7049 0.2614 0.5275 1.6522 1.0531 3.6716 2.1535 0.7300 0.0423 0.1513 0.6410 0.3140 3.0906 3.0714 0.6476 1.0773 0.3844 1.1929 0.6431 0.9529 0.3527 0.9314 1.3736 1.2808 1.0274 1.0188 0.4471 1.3365 4.9684 3.1317 2.3089 3.0892 12.4993 0.5997 1.8299 1.7585 25.0616 0.1227 5.1103 0.1585 13.1135 3.1388 3.1607 0.0590 2.2802 2.1313 1.9162 1.7617 3.4747 5.7219 3.6483 3.3690 1.4929 1.7479 0.3909 4.0976 0.7482 1.5842 5.2697 0.2431 1.3470 3.9942 1.2660 5.9404 1.2969 1.5764 0.0545 2.7741 5.6079 1.7898 5.3387 1.7286 1.9486 1.2615 7.4932 4.2192 0.6399 13.0476 18.1132 0.6275 2.9342 2.4560 28.0408 4.6277 1.1091 11.8069 9.8389 2.5361 20.9606 4.2805 1.4463 2.2255 2.1004 40.5970 7.3337 10.4111 34.1837 32.1706 4.2146 14.5172 1.5326 8.2755 55.8485 0.2210 37.4425 5.6373 10.0447 7.6395 17.3671 9.8905 2.3714 2.0851 0.0411 0.5669 38.7190 2.6118 2.0472 7.1048 1.7866 1.2273 1.2624 0.9033 0.7684 0.9822 4.1490 7.8437 1.6514 3.2036 0.4406 2.3996 2.6998 1.1994 4.2765 4.9521 17.9584 2.7739 8.7483 16.9919 12.1068 1.7487 1.0043 5.2962 0.6933 19.7516 4.0452 5.9748 6.8748 1.3003 1.2039 0.4885 3.1502 6.7309 1.0429 0.5533 2.4625 2.6730 42.3863 8.4270 50.4771 44.0705 3.4499 7.4694 5.0594 34.9670 4.7123 22.8429 11.2599 18.1880 20.1517 4.0834 178.9511 8.8626 43.3170 4.7140 138.8372 7.8152 4.5676 11.6137 23.4772 5.3720 205.6829 8.5341 348.7702 52.8223 7.0827 15.6223 11.1222 5.1665 35.2336 112.1796 112.7951 8.5284 47.8553 30.5192 23.3401 24.3886 8.0534 0.8662 22.9920 20.6639 55.2994 10.0373 501.0733 482.1928 17.8942 16.8811 7.3516 11.0876 7.7006 10.1161 8.6584 9.0888 2.1307 3.2313 0.3236 4.2722 0.8179 3.9407 2.0580 4.5009 5.1037 0.1495 6.6446 2.4272 6.5582 4.6700 1.7807 2.9586 0.3519 0.2945 0.2720 5.2437 0.3845 0.1023
temp: 353.000 k
press: 1.00000 atm
elementType: 6 6 6 6 6 1 1 1 7 6 6 8 8 7 7 6 6 6 1 6 6 6 6 1 46 6 1 6 1 6 6 6 1 6 6 1 1 6 6 1 1 1 6 1 6 1 6 1 1 1 6 6 6 1 6 6 1 1 9 9 6 6 6 6 7 7 7 6 6 6 6 6 1 6 1 6 6 1 6 1 1 1 1
symmnumber: 1
zpe: 1636990.3 jmol-1
zpe.correction: 0.623497 hartree
zpe.thermalcorrener: 0.685705 hartree
zpe.thermalcorrenthalpy: 0.686823 hartree
zpe.thermalcorrgfe: 0.518811 hartree
zpe.sumelectzpe: -2494.633774 hartree
zpe.sumelectthermal: -2494.571566 hartree
zpe.sumelectthermalent: -2494.570448 hartree
zpe.sumelectthermalfe: -2494.738460 hartree
dipole: -0.2891 -4.3191 0.2877
dipole: 4.3383
quadrupole: -457.3820 -282.7401 -303.1577
quadrupole: -1.5448 31.1734 -0.6170
quadrupole: -109.6220 65.0198 44.6022 -1.5448 31.1734 -0.6170
hfenergy: -2495.2572708 hartree
pointgroup: C01 [X(C44H28F2N6O2Pd1)]
dipole: -0.1715861 -1.6680218 0.3186007 debye
polarizability: 537.4304373|-10.752551|609.7030283|-81.580099|-10.6769118|478.7668153 unknown
InChI: InChI=1S/C35H21F2N5O2.C9H7N.Pd/c1-20-22(24-10-3-12-28(36)26(24)18-38)8-5-14-30(20)41-34(43)32-16-7-17-33(40-32)35(44)42-31-15-6-9-23(21(31)2)25-11-4-13-29(37)27(25)19-39;1-2-6-9-8(4-1)5-3-7-10-9;/h3-17H,1-2H3;1-7H;/q-3;-1;+4
charge 0 multiplicity 1
83 atoms
C  -1.04085873 4.32037692 -0.0872615
C  0.92679434 4.08857896 -1.36804324
C  0.94646384 5.45042915 -1.65336265
C  -0.06717849 6.25222193 -1.11528271
C  -1.07386124 5.69154221 -0.319307
H  1.75049985 5.8390496 -2.2804309
H  -0.0729862 7.32539477 -1.31801663
H  -1.8834811 6.27427072 0.12316256
N  -0.05478811 3.58925885 -0.61492317
C  -2.05885807 3.53281403 0.71420708
C  1.94131279 3.0683964 -1.83935112
O  2.82497089 3.39130915 -2.61773841
O  -2.988373 4.09588642 1.26921631
N  -1.7942358 2.19671126 0.66376454
N  1.72437806 1.84666244 -1.26997356
C  2.52560097 0.74691705 -1.64162466
C  3.30423605 -0.80393347 -3.3335708
C  3.71392175 -1.26136288 -0.98520787
H  3.40299975 -1.09030241 -4.38277066
C  -2.65445371 1.25941865 1.27309626
C  -3.26658518 0.28364979 0.453849
C  -3.51964794 0.1826659 3.26159038
C  -3.92806322 -0.79816568 1.07276199
H  -3.64368315 0.15322557 4.346069
Pd -0.02766836 1.69450395 -0.21480203
C  3.79554377 -1.64117141 -2.33282155
H  4.2520635 -2.59848656 -2.59417875
C  -4.04184599 -0.83972566 2.47324683
H  -4.55069907 -1.68361773 2.94435437
C  4.2047836 -2.19697656 0.06109318
C  3.36405458 -2.54499034 1.12796007
C  3.76634093 -3.45336225 2.10493164
H  2.3724973 -2.09103464 1.17500519
C  5.86956124 -3.70393584 0.99824306
C  5.02846372 -4.04595671 2.04723343
H  3.08676476 -3.70790404 2.92138839
H  5.37598927 -4.76091528 2.79393577
C  3.12625592 -0.02783282 -0.6274172
C  -3.22369324 0.47847276 -1.03856988
H  -2.27083556 0.14214043 -1.48044804
H  -4.03527373 -0.06163406 -1.54295593
H  -3.30805911 1.54860148 -1.27317915
C  -2.82051929 1.22906953 2.66216056
H  -2.37522156 2.02949484 3.25769287
C  2.6619997 0.38077552 -2.98859793
H  2.24020949 1.03704442 -3.75263521
C  3.19575015 0.5329041 0.77029477
H  4.05204536 0.12158081 1.32158306
H  3.29612329 1.62607995 0.71994207
H  2.29288209 0.33401114 1.36827452
C  -4.48236014 -1.9258112 0.27328351
C  -3.69211537 -2.56627036 -0.6926549
C  -4.1664925 -3.66073953 -1.41397336
H  -2.68214961 -2.19775391 -0.87701168
C  -6.24956361 -3.51670369 -0.25504141
C  -5.45453027 -4.15097882 -1.1986952
H  -3.51792469 -4.13923516 -2.15143822
H  -5.85774947 -5.00439378 -1.74513808
F  7.07708989 -4.24517387 0.92639022
F  -7.48258449 -3.95275314 -0.04079588
C  5.48632469 -2.78984362 0.00351495
C  -5.7933042 -2.41378328 0.48444525
C  -6.71064688 -1.8076341 1.41001828
C  6.44074791 -2.47555237 -1.02386576
N  7.22884443 -2.24011045 -1.84236012
N  -7.47150682 -1.33853866 2.15001959
N  -0.0767355 -0.28307938 0.40331697
C  -0.0957358 -1.37903432 -0.42204882
C  -0.1913227 -0.45083024 1.71333625
C  -0.0145779 -1.21055369 -1.82779528
C  -0.2254404 -2.69227888 0.11924445
C  -0.35465744 -1.71255342 2.3222028
H  -0.1704521 0.45836497 2.31962119
C  -0.02559853 -2.31001244 -2.65512533
H  0.06257602 -0.1952821 -2.22321908
C  -0.23378099 -3.80731618 -0.76298955
C  -0.3741861 -2.83130586 1.52190431
H  -0.47305892 -1.77006767 3.40423068
C  -0.13072476 -3.62098793 -2.12164161
H  0.05477751 -2.17049675 -3.73498409
H  -0.3290438 -4.80908607 -0.33747627
H  -0.50294099 -3.82987344 1.9474111
H  -0.13104435 -4.47975768 -2.79575892
