program: Gaussian 16
title: Title Card Required
version: ES64L-G16RevA.03
method: RMN15
basis: Gen
operation: Freq
keyword: #N
keyword: Geom=AllCheck
keyword: Guess=TCheck
keyword: SCRF=Check
keyword: GenChk
keyword: RMN15/ChkBas
keyword: Freq
converged: YES YES NO YES
title: Mulliken charges:
elementType: C C C C C H H H N C C O O N N C C C H C C C C H Pd C H C H C C C C H C C H H C C H C H C C C C H C C H H C C N N N C C C C C H C H C C H C H H H H C H H H C H H H F F
charge: 0.065687 0.065467 0.000838 0.088641 -0.003091 0.019353 0.017108 0.016526 -0.161411 0.153601 0.156370 -0.213505 -0.220053 -0.324983 -0.322406 0.029431 -0.002800 -0.075181 -0.019335 0.025213 -0.061135 -0.009861 -0.064632 -0.020033 0.067602 0.032682 -0.033124 0.047426 -0.023705 0.060520 -0.013504 -0.170472 0.057976 -0.041398 0.255922 -0.050426 0.000402 0.003387 -0.035638 0.110400 -0.031600 0.062706 -0.019337 0.084379 -0.027003 -0.184340 0.056696 -0.008926 0.254760 -0.050669 0.007692 0.005680 -0.192407 -0.192212 0.114560 0.136201 -0.128393 0.016831 0.113351 0.093229 0.084069 0.040057 0.059420 0.005636 0.013111 -0.006301 0.050467 0.002882 0.052673 -0.002699 -0.007498 0.003026 -0.003518 0.161183 0.026119 0.047482 0.015192 0.152282 0.005893 0.045844 0.031979 -0.147094 -0.149259
chargesum: -0.00000
title: Mulliken charges with hydrogens summed into heavy atoms:
elementType: C C C C C N C C O O N N C C C C C C C Pd C C C C C C C C C C C C C C C C C C C N N N C C C C C C C C C C C F F
charge: 0.065687 0.065467 0.020191 0.105749 0.013435 -0.161411 0.153601 0.156370 -0.213505 -0.220053 -0.324983 -0.322406 0.029431 -0.022135 -0.075181 0.025213 -0.061135 -0.029894 -0.064632 0.067602 -0.000442 0.023721 0.060520 -0.054902 -0.170472 0.058378 0.255922 -0.047039 -0.035638 0.078800 0.043369 0.084379 -0.035929 -0.184340 0.064388 0.254760 -0.044989 -0.192407 -0.192212 0.114560 0.136201 -0.128393 0.016831 0.172771 0.106340 0.084069 0.042939 0.002937 -0.013800 0.053493 0.049155 0.249976 0.235997 -0.147094 -0.149259
1716.lowfreq: -1.9234 -0.0004 -0.0003 0.0004 2.4440 4.3570 14.1799 17.3006 23.6829
frequency: 14.0414 17.1933 23.6594 25.8946 28.6946 34.5562 44.0520 44.4067 55.4486 59.6557 64.5842 71.7871 80.5307 85.1264 88.2092 98.8178 103.5562 114.1273 121.9538 133.2993 138.5253 141.4561 146.9703 152.1020 162.8973 169.3467 179.8543 184.4792 194.6927 196.4908 207.4970 214.0475 222.2524 234.2636 243.2400 245.3478 248.8174 255.2699 262.2223 275.6548 283.4813 285.9011 293.0163 296.3916 299.6783 327.8842 332.4154 348.4936 369.3489 390.3961 392.4954 403.3199 407.2646 412.4177 428.0926 432.1261 441.0919 448.0056 462.0749 462.9376 471.4185 482.8211 484.6759 497.3109 516.5523 517.1624 519.0457 521.8238 526.0496 530.9327 533.9007 555.2067 560.3262 581.6597 582.2275 589.9874 592.5569 596.8527 601.4076 635.6800 638.3581 639.7665 642.8788 646.4702 657.2664 663.2427 668.4014 693.2547 703.9412 740.7429 743.2313 751.2493 759.2680 767.0094 772.4890 773.4512 784.9927 789.5686 792.0931 802.3113 803.7125 805.1671 810.1179 814.1206 814.7667 822.9549 830.4650 838.4348 842.2848 858.8428 866.9114 885.3814 901.6273 925.1849 934.1367 937.5796 939.4402 942.4058 946.0207 957.4696 970.5287 976.3512 980.7504 997.4883 1003.4391 1017.0347 1020.9792 1025.3836 1026.9761 1027.8997 1032.0611 1034.5146 1045.5890 1046.4970 1050.4193 1051.7265 1054.5322 1056.7619 1077.4599 1078.2570 1086.7053 1096.1133 1099.9574 1107.6607 1129.2392 1133.7966 1137.3435 1137.6348 1148.7047 1152.2236 1158.2132 1162.0681 1171.9155 1173.3365 1210.8544 1214.0005 1217.1954 1221.0064 1222.2842 1226.7902 1239.8823 1255.7936 1262.6968 1269.9905 1277.9229 1289.4515 1308.3878 1343.2280 1345.7719 1351.7939 1356.5903 1357.9496 1358.8476 1368.6291 1372.7276 1379.9046 1381.5853 1402.0131 1408.8540 1418.2061 1421.5381 1427.5070 1437.3410 1437.7572 1448.6433 1473.2576 1477.9045 1483.0429 1489.8427 1502.4471 1504.2022 1507.1241 1523.5902 1524.5332 1525.0066 1534.3353 1535.4305 1573.9281 1656.2608 1659.3931 1664.0678 1664.4206 1667.2079 1670.0768 1672.8682 1673.1184 1679.3551 1690.3852 1690.6439 1691.6162 1708.5727 1809.9987 1818.0384 2397.2145 2406.4476 3067.8822 3072.4912 3146.8017 3155.9921 3180.1735 3189.8495 3218.5619 3222.3727 3224.1417 3225.7847 3233.6390 3236.1452 3236.7105 3237.5528 3241.1513 3242.3425 3246.6548 3247.2517 3247.9973 3248.7668 3249.0617 3256.2579 3258.5964 3264.0800 3265.0699 3265.9849 3266.3865 3268.7424
redmass: 6.9013 8.9535 7.1605 6.6780 7.2549 8.0712 6.5355 5.8053 9.6681 5.9136 5.7953 6.6435 7.5812 8.0179 6.9578 4.9300 6.0579 6.4858 4.0069 4.2218 6.3359 7.3298 6.0830 3.9835 3.6017 4.3533 7.9685 4.5726 3.7875 4.7601 4.2570 2.2647 1.9684 5.0389 4.8007 4.4941 4.6059 4.5041 4.4036 5.2816 4.9487 7.7548 5.7324 6.6111 5.5437 5.4564 5.0687 7.9290 4.1600 5.0792 7.0293 4.5006 6.2268 6.1955 3.6264 8.4611 4.9795 4.8475 10.3740 9.5533 3.9803 3.1877 4.2340 4.4712 4.6657 6.4232 3.7836 3.4089 4.0957 7.0278 4.6258 7.1523 7.3783 6.9653 5.7798 4.8009 5.4052 6.5321 6.5191 6.5000 5.6478 5.3874 6.1518 3.4030 5.7192 5.9587 6.4275 7.9656 6.7973 2.1522 1.8727 4.0324 1.2686 3.3346 2.2612 2.2673 7.3469 1.8814 4.2673 4.5642 4.8402 3.9176 2.2925 3.7880 2.0168 2.2124 1.4280 2.4930 2.4101 5.6751 2.4167 6.8491 1.8791 2.1832 1.5408 1.4362 1.6751 1.5592 1.7886 5.7954 2.6041 1.4323 1.4192 2.8640 1.3719 1.5006 1.5416 1.5364 1.3909 1.8152 1.3560 1.3743 1.4368 1.7044 2.1076 2.1204 1.4092 2.4234 1.6737 1.6899 2.0261 1.7807 1.7822 3.4745 1.1290 1.2953 1.4817 1.3516 1.2116 1.0910 1.2185 1.2531 2.0317 2.4263 2.0669 2.8328 2.6413 2.3355 2.7195 2.2532 2.1042 1.7603 1.9524 1.5960 1.8476 2.0883 3.4024 5.9715 6.4138 4.6981 3.8739 7.0248 7.2443 1.6023 1.4432 4.0488 3.4719 4.1578 2.1144 1.5166 1.1169 2.1728 1.0931 1.1108 3.2908 3.7505 4.8232 3.9521 3.2709 3.8873 3.2561 4.8596 5.0907 4.4582 5.1748 4.3678 4.6983 4.7176 7.6165 7.5763 7.7419 7.7387 7.5841 7.7760 6.6897 8.0996 9.0031 8.6247 8.4407 8.2789 7.2822 12.9389 12.8986 12.6770 12.6735 1.0399 1.0393 1.0989 1.1021 1.1044 1.1014 1.0909 1.0880 1.0930 1.0875 1.0884 1.0927 1.0927 1.0902 1.0886 1.0909 1.0921 1.0947 1.0939 1.0988 1.0995 1.0949 1.0996 1.0973 1.0992 1.0978 1.0943 1.0978
irintensity: 0.1690 0.4560 0.7428 1.5506 0.0518 0.1135 1.7818 0.3095 0.3549 0.1377 0.3107 0.6856 0.5695 5.4498 1.9762 1.8989 1.8377 0.7998 1.0861 1.5321 3.7632 2.1112 1.1647 2.4925 1.1935 0.1503 1.6847 0.8379 0.4662 0.8533 3.3129 1.3151 0.4692 0.4145 1.6416 4.7697 1.1560 0.4879 0.5134 0.1732 3.4410 8.2614 0.5723 4.0047 1.9297 22.4846 2.3041 4.2251 0.3243 4.2481 14.8008 3.9580 1.1751 1.4716 5.0458 1.5221 2.2711 2.3846 5.7875 3.3398 1.6311 5.0586 0.3815 1.2884 2.2814 1.3057 1.1987 1.1614 8.7363 7.6655 3.9855 1.1790 3.5411 1.1440 7.8063 2.0814 1.5174 2.4238 1.3700 2.1328 2.4391 2.5636 9.3350 0.2253 5.9350 4.4392 11.9359 16.4200 0.6624 7.1296 12.4191 6.6818 2.6143 7.9879 1.7884 26.9886 1.9128 21.1626 6.4313 0.8473 0.8718 1.4199 47.4591 13.8140 2.6966 24.2101 39.6639 17.1113 17.6188 0.4793 8.9698 40.9003 1.1792 28.0056 8.3033 1.0642 27.8006 6.4166 15.7862 1.2044 6.2983 0.0465 0.6327 41.6510 6.2889 1.6115 5.7798 3.6248 2.9761 2.0094 1.6131 3.1139 1.0780 7.8029 4.5395 9.8728 1.5800 10.4128 2.9757 4.2407 0.5672 4.8678 4.5176 17.3762 2.2553 4.3929 9.8343 8.5297 2.1103 1.6857 1.5249 2.1904 15.2448 10.7714 5.3784 4.7181 0.4887 1.6231 2.1861 5.6682 6.0051 0.9320 1.5916 1.5566 10.1679 21.8546 10.9838 25.2891 1.6373 21.0723 30.2807 17.7475 24.5347 8.7229 15.7585 22.3293 18.0434 24.1399 5.3995 111.2369 2.7784 235.5145 10.1500 1.7255 9.5442 9.0622 13.4930 14.7447 40.4514 123.8275 12.5603 264.6114 29.6166 5.0258 111.2225 11.4269 14.1827 35.7932 85.9415 50.2095 56.4230 37.9245 23.8194 14.0761 3.5243 59.0271 0.1526 69.5611 11.4596 49.6692 10.8883 535.0948 465.0334 40.7445 16.0735 10.7103 7.1443 6.6787 4.9298 6.1827 5.2966 0.4046 2.0165 1.0526 1.4709 2.2888 10.0641 5.4134 3.4717 3.2007 7.2212 0.7600 3.7810 2.5175 6.7624 6.6028 1.7590 3.4352 0.3958 0.3502 0.1532 4.4402 0.1547
temp: 353.000 k
press: 1.00000 atm
elementType: 6 6 6 6 6 1 1 1 7 6 6 8 8 7 7 6 6 6 1 6 6 6 6 1 46 6 1 6 1 6 6 6 6 1 6 6 1 1 6 6 1 6 1 6 6 6 6 1 6 6 1 1 6 6 7 7 7 6 6 6 6 6 1 6 1 6 6 1 6 1 1 1 1 6 1 1 1 6 1 1 1 9 9
symmnumber: 1
zpe: 1635904.9 jmol-1
zpe.correction: 0.623083 hartree
zpe.thermalcorrener: 0.685400 hartree
zpe.thermalcorrenthalpy: 0.686518 hartree
zpe.thermalcorrgfe: 0.517934 hartree
zpe.sumelectzpe: -2494.637864 hartree
zpe.sumelectthermal: -2494.575548 hartree
zpe.sumelectthermalent: -2494.574430 hartree
zpe.sumelectthermalfe: -2494.743014 hartree
dipole: 6.8469 -2.8280 -1.7226
dipole: 7.6056
quadrupole: -373.2218 -299.2506 -305.4749
quadrupole: 8.0937 -22.4336 3.7030
quadrupole: -47.2394 26.7318 20.5076 8.0937 -22.4336 3.7030
hfenergy: -2495.2609476 hartree
pointgroup: C01 [X(C44H28F2N6O2Pd1)]
dipole: 2.0092024 -1.9857666 -0.9866625 debye
polarizability: 490.7408896|-49.7025482|580.6154013|10.5246995|-66.2487855|530.505834 unknown
InChI: InChI=1S/C35H21F2N5O2.C9H7N.Pd/c1-20-22(24-10-3-12-28(36)26(24)18-38)8-5-14-30(20)41-34(43)32-16-7-17-33(40-32)35(44)42-31-15-6-9-23(21(31)2)25-11-4-13-29(37)27(25)19-39;1-2-6-9-8(4-1)5-3-7-10-9;/h3-17H,1-2H3;1-7H;/q-3;-1;+4
charge 0 multiplicity 1
83 atoms
C  0.52447285 4.37043432 -1.56439929
C  -1.80846861 4.21848214 -1.20554619
C  -2.03587394 5.36610044 -1.95958771
C  -0.92812597 6.02452783 -2.50796751
C  0.36918463 5.53118937 -2.31548756
H  -3.06356832 5.70619299 -2.09690856
H  -1.07780267 6.93138745 -3.09808785
H  1.25884063 6.00759402 -2.7304758
N  -0.55720668 3.7828608 -1.04649466
C  1.83446731 3.65317306 -1.28491265
C  -2.86621111 3.34459646 -0.55507626
O  -4.0509668 3.54579549 -0.77114675
O  2.8914461 4.1094737 -1.69399729
N  1.62768471 2.49567706 -0.5977347
N  -2.30173937 2.381952 0.22806454
C  -3.07403668 1.32843627 0.76123144
C  -4.44942208 -0.63546356 0.36887337
C  -3.56025319 -0.19486533 2.58049323
H  -5.04127128 -1.25535112 -0.30796823
C  2.70749919 1.64464302 -0.27354222
C  2.74254352 0.32747017 -0.78564581
C  4.683281 1.21156957 1.06872972
C  3.76206257 -0.54190044 -0.3348244
H  5.43782005 1.55486969 1.779422
Pd -0.28501166 2.20351162 0.03314023
C  -4.2823224 -1.01263574 1.7008851
H  -4.73129388 -1.93454361 2.07885086
C  4.70532772 -0.10191292 0.606537
H  5.48627137 -0.78800034 0.94327172
C  -3.39732441 -0.65948268 3.98762697
C  -2.66327014 -1.82148446 4.25363644
C  -3.98527695 0.02643667 5.07307777
C  -2.49839766 -2.28780541 5.5595097
H  -2.21081801 -2.35392279 3.4143312
C  -3.80564286 -0.45934118 6.37623335
C  -3.06738808 -1.60642523 6.63472238
H  -1.91673385 -3.19336071 5.74390002
H  -2.95646 -1.94353701 7.66606422
C  -2.96219497 1.00076375 2.13092937
C  3.69548492 2.08154868 0.61837094
H  3.65053077 3.11439949 0.97029551
C  -3.84524027 0.52844678 -0.09651683
H  -3.94515696 0.83544035 -1.13976823
C  3.92565492 -1.90861101 -0.90404468
C  4.04196432 -2.08464116 -2.29031895
C  4.0355266 -3.05562836 -0.08353776
C  4.24923799 -3.34434568 -2.85029088
H  3.99026822 -1.20455956 -2.93307255
C  4.24288399 -4.31518353 -0.67003335
C  4.34922975 -4.47775505 -2.0423788
H  4.34371382 -3.44578768 -3.93330202
H  4.51234314 -5.47636702 -2.44920412
C  3.93323658 -3.00680904 1.34801478
C  -4.78800055 1.20154187 4.88176328
N  3.85372701 -3.01661437 2.50638792
N  -5.43232141 2.15603573 4.73889072
N  0.06993302 0.53017798 1.1685218
C  0.9124177 0.5719224 2.25307904
C  -0.4003856 -0.62983754 0.73847445
C  1.34628496 1.81762387 2.7746508
C  1.34926528 -0.63312438 2.87071146
C  -0.02598821 -1.86452275 1.30791498
H  -1.10295709 -0.58858752 -0.10023411
C  2.18790396 1.85125083 3.86247461
H  1.00320789 2.73492242 2.28826646
C  2.24806778 -0.56647166 3.97046583
C  0.86075553 -1.86342652 2.36104201
H  -0.43936891 -2.78795813 0.90127543
C  2.65448445 0.65271879 4.4592829
H  2.51252536 2.81404883 4.26276285
H  2.6091702 -1.50180342 4.40197231
H  1.19993699 -2.79423244 2.82082182
H  3.33889435 0.70264005 5.3082181
C  -2.19828619 1.89757309 3.06600543
H  -1.4628936 2.49976681 2.51667019
H  -2.88167863 2.60459817 3.56299882
H  -1.67601694 1.32758635 3.84933631
C  1.70931394 -0.10483525 -1.79435974
H  1.51284948 -1.18515128 -1.74586667
H  0.76566205 0.43774361 -1.63977687
H  2.02994713 0.13065194 -2.82236082
F  -4.36642203 0.19810504 7.38102041
F  4.33295652 -5.37253646 0.12552187
