program: Gaussian 09
title: 000036632
version: EM64L-G09RevD.01
frameworkgroup: C1[X(C18H13N)]
method: RPBEPBE
basis: SDD
operation: Freq
keyword: #pfreq=noraman
keyword: PBEPBE/SDD
title: #p freq=noraman PBEPBE/SDD
converged: YES YES NO NO
title: Mulliken charges:
elementType: N C C C C C C C C C C C C C C C C C C H H H H H H H H H H H H H
charge: -0.023155 -0.244769 0.464549 0.255694 0.431904 0.422783 -0.091851 -0.477055 -0.453428 -0.471280 -0.599623 0.442382 -0.387495 -0.327930 -0.430405 -0.341693 -0.240597 -0.242189 -0.814216 0.252205 0.233209 0.235739 0.238532 0.285975 0.261431 0.238791 0.234052 0.229650 0.227993 0.231932 0.226740 0.232125
chargesum: 0.00000
title: Mulliken charges with hydrogens summed into heavy atoms:
elementType: N C C C C C C C C C C C C C C C C C C
charge: -0.023155 -0.244769 0.464549 0.255694 0.431904 0.422783 -0.091851 -0.224850 -0.220219 -0.235542 -0.361090 0.442382 -0.101519 -0.066499 -0.191614 -0.107641 -0.010948 -0.014196 -0.123419
polarizability: 4.07868900e+02 -1.08189587e+00 2.11361841e+02 2.04976069e-02 -3.00010110e-03 7.97291551e+01
1716.lowfreq: -0.0005 0.0004 0.0008 2.9651 6.8366 16.0948 53.4725 79.5304 96.5160
frequency: 53.4679 79.5292 96.5085 131.9532 137.8827 174.2328 229.6663 241.1677 274.6308 333.8504 349.3121 367.2135 400.2577 433.2570 456.3883 482.1935 493.0816 500.7996 525.4633 532.8120 560.8777 597.9770 618.8256 646.2760 706.0050 708.5423 743.8956 761.8762 765.1208 782.4295 790.9166 823.1707 824.3863 845.3799 874.5935 880.0669 900.2483 937.1080 937.8498 970.8484 982.8791 985.9345 993.8425 1006.4187 1009.9181 1035.4721 1048.7278 1098.2858 1140.1278 1144.9569 1170.3863 1180.2999 1196.6987 1221.6282 1230.2609 1247.5011 1270.7453 1300.9192 1321.7615 1339.9128 1385.7190 1393.9407 1397.4787 1409.0589 1421.0446 1438.6644 1455.0557 1467.4685 1471.6268 1481.6036 1499.0861 1532.7573 1559.4651 1584.9384 1615.1365 1619.9058 1641.4323 2974.3628 3050.6995 3086.0917 3113.3529 3115.6217 3118.6491 3121.2924 3123.0124 3135.9642 3141.8559 3154.9837 3162.1425 3170.4873
redmass: 4.5317 2.7359 1.2387 3.6016 4.5582 4.3628 4.2791 4.0162 4.0418 5.1137 4.1725 3.7094 3.5549 3.1736 5.2810 3.1018 6.3892 5.1636 3.5411 6.3612 3.0016 3.2576 7.7923 6.3452 6.9644 3.3263 5.5687 5.7991 1.2434 2.7144 5.1570 2.0333 1.4624 2.0874 4.6911 1.4326 1.6668 1.6493 2.6646 1.3744 1.3345 1.4052 3.6636 1.3450 1.9610 2.0529 1.5635 2.1747 1.4193 1.3696 1.0972 1.8498 1.4718 2.0855 2.0202 1.8935 2.0342 2.0513 2.6991 3.6911 3.3814 2.6104 1.2618 5.1940 4.0143 3.4033 2.4949 1.0457 1.9536 1.8489 3.7469 5.7351 7.0546 6.0469 6.8004 6.4983 6.7251 1.0374 1.0973 1.0986 1.0918 1.0868 1.0910 1.0865 1.0890 1.0902 1.0980 1.0955 1.0959 1.0978
irintensity: 1.7741 0.1257 0.2726 0.0143 1.0006 4.1839 1.0070 0.5350 0.3204 0.1124 3.8937 3.7242 1.2842 0.9359 1.3868 5.3833 0.2622 3.3414 1.3982 0.0683 20.5079 0.0329 2.2181 5.3020 0.7229 7.1167 0.8887 2.2019 36.2038 0.0549 0.1621 8.5392 92.7305 3.7111 7.2538 6.9398 1.4560 39.1381 0.3300 5.3808 3.8184 0.1307 1.6035 0.8606 18.5745 4.9510 13.1254 4.3974 8.2465 0.6826 2.6021 1.0666 2.4118 1.9487 9.1273 0.3883 0.5364 3.1311 4.9451 10.4532 5.6863 17.3002 6.2044 10.9587 0.4410 23.7637 1.3847 13.5756 0.9708 9.4412 41.0715 15.7146 1.3335 12.7446 0.5956 0.5304 12.5114 47.1859 20.0093 16.7443 14.8260 0.6462 20.9822 2.8219 16.9463 11.8948 40.8181 32.7326 13.1798 24.0129
temp: 298.150 k
press: 1.00000 atm
elementType: 7 6 6 6 6 6 6 6 6 6 6 6 6 6 6 6 6 6 6 1 1 1 1 1 1 1 1 1 1 1 1 1
symmnumber: 1
zpe: 662370.1 jmol-1
zpe.correction: 0.252283 hartree
zpe.thermalcorrener: 0.266252 hartree
zpe.thermalcorrenthalpy: 0.267197 hartree
zpe.thermalcorrgfe: 0.211712 hartree
zpe.sumelectzpe: -747.237554 hartree
zpe.sumelectthermal: -747.223585 hartree
zpe.sumelectthermalent: -747.222641 hartree
zpe.sumelectthermalfe: -747.278126 hartree
dipole: 1.2436 1.5740 -0.0002
dipole: 2.0060
quadrupole: -84.7938 -96.8335 -117.3743
quadrupole: -0.6730 0.0048 -0.0025
quadrupole: 14.8734 2.8337 -17.7071 -0.6730 0.0048 -0.0025
hfenergy: -747.4898373 hartree
pointgroup: C01 [X(C18H13N1)]
dipole: 0.4867629 0.6211489 -0.0111095 debye
polarizability: 407.8741928|-0.2790096|211.3116477|0.2934531|-2.4238247|79.7740553 unknown
InChI: InChI=1S/C18H13N/c1-12-6-9-17-15(10-12)11-14-8-7-13-4-2-3-5-16(13)18(14)19-17/h2-11H,1H3
charge 0 multiplicity 1
32 atoms
N  0.270205 -1.019648 0.019629
C  -0.645727 -0.012077 0.000242
C  -0.261446 1.393744 -0.025288
C  -2.070943 -0.361148 0.0052
C  2.088951 0.675627 -0.010458
C  -3.055133 0.687644 -0.015118
C  1.607089 -0.698254 0.014757
C  1.114304 1.707796 -0.030128
C  -1.290442 2.413533 -0.044951
C  -2.627789 2.074702 -0.040118
C  3.504153 0.923526 -0.014379
C  4.427501 -0.12372 0.005599
C  -2.498633 -1.718656 0.029733
C  2.571783 -1.761704 0.035279
C  -4.439995 0.342181 -0.010388
C  3.934559 -1.480609 0.030788
C  -3.865805 -2.03683 0.034013
C  -4.843364 -1.001255 0.013812
C  5.923677 0.125913 0.001555
H  1.432122 2.758018 -0.049365
H  -0.981355 3.465655 -0.064031
H  -3.397772 2.85529 -0.055258
H  3.856271 1.963072 -0.033672
H  -1.729045 -2.49568 0.044932
H  2.192769 -2.788225 0.054321
H  -5.187855 1.144094 -0.025999
H  4.660943 -2.302721 0.04667
H  -4.184337 -3.084861 0.05304
H  -5.909082 -1.255651 0.017278
H  6.404888 -0.34698 -0.875684
H  6.158177 1.203603 -0.024093
H  6.402531 -0.304079 0.901883
