program: Gaussian 16
title: Title Card Required
version: ES64L-G16RevA.03
method: RMN15
basis: Gen
operation: Freq
keyword: #N
keyword: Geom=AllCheck
keyword: Guess=TCheck
keyword: SCRF=Check
keyword: GenChk
keyword: RMN15/ChkBas
keyword: Freq
converged: YES YES YES YES
title: Mulliken charges:
elementType: C C C C C H H H N C C O O N C C C H C C C C H Pd C H C H C C C C H C C H H C C H H H C C H C H C H H H C C C C H C C H H F F C N N C C C C C H C H C C H C H H H N Pd N O C O C H H C C H H H O N H C H C H H C O O C H H C H H H
charge: 0.080033 0.077035 -0.004114 0.088862 -0.004374 0.016707 0.017080 0.017875 -0.164129 0.149818 0.142942 -0.222623 -0.223018 -0.324751 0.040830 0.005917 -0.090063 -0.007525 0.048175 -0.045751 0.005528 -0.076939 -0.024404 0.101543 0.045905 -0.016251 0.041206 -0.032951 0.075614 -0.016837 -0.187486 0.057947 -0.000065 0.270151 -0.048989 0.013478 0.011373 -0.024319 0.153738 0.025234 0.003852 0.050487 -0.114033 0.063681 -0.022634 0.056439 -0.011449 0.157959 0.044026 0.002494 0.005718 0.051119 -0.020481 -0.175341 0.055651 -0.007887 0.258926 -0.048388 0.008064 0.005929 -0.139865 -0.147256 -0.169251 0.114231 -0.331075 0.029875 0.117886 0.078308 0.128822 0.049146 0.055344 0.018657 0.014916 -0.236486 0.086294 -0.000907 0.019309 -0.008717 0.014416 0.002668 -0.131256 -0.146865 0.216623 -0.324295 0.125229 -0.289351 0.230005 0.008907 0.048365 0.018775 0.033441 0.011947 0.034336 0.049314 -0.262356 -0.180894 0.128568 0.048670 0.041670 0.190518 0.070032 0.059907 0.203865 -0.222867 -0.288706 0.155333 0.023871 0.032147 -0.020738 0.024598 0.018011 0.060350
chargesum: -0.00000
title: Mulliken charges with hydrogens summed into heavy atoms:
elementType: C C C C C N C C O O N C C C C C C C Pd C C C C C C C C C C C C C C C C C C C C F F C N N C C C C C C C C C N Pd N O C O C C C O N C C C O O C C
charge: 0.080033 0.077035 0.012593 0.105942 0.013501 -0.164129 0.149818 0.142942 -0.222623 -0.223018 -0.324751 0.040830 -0.001608 -0.090063 0.048175 -0.045751 -0.018876 -0.076939 0.101543 0.029654 0.008256 0.075614 -0.016903 -0.187486 0.071425 0.270151 -0.037616 -0.024319 0.233311 -0.114033 0.041047 0.044990 0.210197 0.051119 -0.028368 -0.175341 0.063715 0.258926 -0.042460 -0.139865 -0.147256 -0.169251 0.114231 -0.331075 0.029875 0.173229 0.093224 0.128822 0.048239 0.009940 -0.236486 0.100710 0.021977 -0.131256 -0.146865 0.216623 -0.324295 0.125229 -0.289351 0.287276 0.018775 0.129037 -0.262356 -0.052326 0.090340 0.320457 0.203865 -0.222867 -0.288706 0.211351 0.082220
1716.lowfreq: -297.4868 -2.3263 -1.9908 -0.0020 -0.0014 0.0008 2.2429 10.5565 12.0288
redmass: 7.8005 7.5328 7.0211 6.0849 5.7475 8.1976 5.9129 5.8797 6.7931 5.8858 6.6287 5.5481 4.5360 1.9236 5.7733 5.1512 4.2761 2.9797 5.8645 6.2506 6.3069 6.3510 5.3217 5.3156 3.7840 6.9198 4.4944 6.6595 5.3790 7.0227 5.7945 6.6022 5.2240 5.2144 4.5372 7.4252 6.4666 8.6634 6.6137 4.6440 4.7078 4.9845 5.3175 5.9954 4.9490 3.9867 4.2786 2.1021 4.4251 2.5118 5.8378 6.7513 1.6749 5.0585 4.4204 7.5732 4.9836 4.8615 5.2735 4.3977 3.3793 5.4060 6.9733 5.4244 1.6916 5.8858 6.4615 5.4016 4.6220 2.0924 6.3992 8.7351 6.4357 4.1246 4.2535 4.5915 3.1078 7.4440 6.6375 6.9158 5.1541 5.1371 4.9346 5.2180 4.6991 4.7568 9.8234 3.8676 3.4409 4.8389 8.6477 5.0470 4.4385 3.5205 4.0667 6.6139 3.2745 4.6887 4.0158 6.4505 7.0667 6.7022 6.4666 4.0321 4.9180 6.8719 4.9383 2.1819 5.3201 6.3339 7.0252 3.2004 3.8122 5.4351 5.4329 1.5739 5.8889 5.5724 5.8862 6.0488 5.9657 7.3204 3.1832 7.9933 6.7783 2.0914 2.2955 4.2185 2.0384 3.0207 3.6722 2.1377 2.6325 3.0790 4.7176 4.1854 1.9980 1.1485 4.4681 4.6225 4.3866 1.8903 4.1478 1.9604 1.5341 2.4736 2.2511 3.8063 3.1220 1.7187 2.4394 6.5491 2.4294 2.7933 1.3959 3.1733 1.5225 1.4575 1.4108 1.5918 1.8352 1.5543 5.2579 5.7091 1.7132 1.6447 1.5984 2.4646 1.4039 2.9076 1.5003 1.8521 1.5234 1.4728 1.5076 1.4464 1.4282 1.3609 1.7686 1.9652 1.7591 1.3680 2.4881 2.4618 2.0571 1.7168 1.6827 1.4583 1.7002 1.8176 1.7722 3.4156 1.2739 2.0424 1.1300 2.2132 1.2779 1.3353 1.3282 1.1420 1.2512 1.2716 1.6631 2.8387 2.4133 3.0314 1.5658 1.6840 1.8347 2.3513 1.1940 2.7480 2.5762 2.3112 2.8656 1.9760 1.6988 1.9661 1.4954 1.9041 1.1722 2.0204 3.3602 1.4494 1.8545 5.1359 6.7468 1.2795 4.3893 3.3245 5.7301 3.1291 6.5577 1.4834 1.6472 1.6283 4.2558 1.7602 2.4060 1.4593 2.1811 1.1079 1.0965 1.0656 1.9498 2.0643 1.0889 4.8181 1.0734 1.1218 7.4271 1.1266 2.5476 1.4740 1.8458 1.7811 2.4875 3.6825 3.1693 3.1471 4.7194 4.9923 4.8220 4.4581 5.5062 4.4678 4.3978 2.9860 4.6894 7.6730 7.7002 7.5840 6.9683 7.6084 7.8714 7.7425 7.9866 9.0505 7.4552 8.6263 8.4406 8.3462 11.5886 12.5595 12.5726 10.9320 11.3606 12.6755 12.7067 1.0425 1.0372 1.0371 1.0372 1.0614 1.0645 1.0985 1.1005 1.1047 1.1040 1.0574 1.1051 1.1029 1.1034 1.1058 1.1022 1.0906 1.0894 1.1055 1.0886 1.0921 1.0888 1.0918 1.0937 1.0926 1.0940 1.0886 1.0888 1.0975 1.0909 1.0990 1.0986 1.0955 1.0958 1.0975 1.0942 1.0973 1.0978 1.0958 1.1165 1.0791
irintensity: 56.4096 0.1763 0.2973 0.5381 2.0246 0.2068 0.7919 0.5160 0.7452 1.2557 0.4408 0.5231 0.0398 0.8967 0.2737 2.9817 0.3766 0.5432 2.7281 2.5064 1.1424 4.5734 2.8897 2.9484 0.3288 0.9565 1.8024 1.8038 1.9959 1.3330 0.7319 1.6000 1.2193 3.6764 4.5695 1.6489 2.4179 8.4966 2.1074 2.9740 2.7771 1.8621 0.9211 1.2202 0.3978 1.3244 1.5120 0.4636 1.5710 2.8809 0.6307 1.1515 0.7224 1.6513 0.8272 0.7400 0.5374 2.1544 0.8035 4.0732 6.5466 0.3040 7.8566 0.2815 1.3744 5.7253 6.0772 2.7014 10.1328 7.2029 11.7468 8.2629 3.6430 1.5918 5.0348 10.5275 4.6727 8.5794 1.3828 2.2770 3.6708 7.1831 17.3865 8.6184 4.7797 4.7640 4.8346 6.5685 3.5736 0.8500 7.7214 15.4166 3.2936 14.2043 3.4134 0.9839 1.4391 1.2933 1.4004 1.0805 2.2674 4.8393 1.4598 6.3474 13.1958 0.9010 6.2500 42.3580 2.2713 0.7716 4.0596 42.3825 2.5422 3.6096 1.7101 31.4408 0.9927 3.4296 2.3753 0.8574 2.2947 20.3369 43.2038 18.1320 0.4650 21.7003 10.3849 10.7547 12.2182 36.5258 11.5538 6.9768 4.7570 8.3035 3.8774 2.2694 18.7252 2.5697 3.9467 5.5545 5.9934 28.6271 7.6644 53.3555 34.9379 13.9184 16.9325 13.9808 0.8849 4.9199 11.3659 31.8973 7.8186 14.1956 11.3012 36.6667 2.8370 0.9799 1.6763 1.9145 14.3000 5.7084 7.8015 4.9746 0.7741 0.0947 1.8358 12.1816 2.3762 21.3789 2.3485 8.3099 1.0950 3.5928 0.8065 2.3043 2.8688 1.3989 8.7364 13.2120 7.6485 0.4085 38.9421 9.0114 4.2648 4.3274 1.3468 6.9161 3.1531 1.9282 2.0929 21.6743 6.8770 8.4479 1.4504 81.8265 5.9922 11.5981 2.4780 6.5177 4.7924 4.2545 3.7122 1.5260 26.3404 1.2787 16.3168 7.9371 2.6236 11.0409 35.1492 2.6526 1.2563 5.7048 1.8124 17.7334 1.1096 2.0456 68.9417 8.9179 44.1673 22.4793 4.9634 9.3352 127.2261 19.1475 32.8169 0.6412 17.4279 19.0591 6.5595 34.8539 10.0644 34.8076 9.7894 34.5963 20.4081 144.4384 2.9986 12.4178 27.1880 43.4592 10.5068 38.2562 5.2009 33.9002 8.7103 260.6635 6.5007 1.0338 6.7715 15.0508 266.4606 146.7790 15.0352 18.7143 44.8444 7.0309 10.5870 40.0238 95.5125 318.5076 74.2846 20.9745 38.7865 20.6536 23.6421 485.7300 10.4529 61.9059 106.4379 40.7417 2.2100 42.3635 62.2611 7.4823 43.6936 0.3459 27.5462 54.8340 67.3002 66.9819 223.1417 541.4723 449.1651 524.5996 227.8739 54.6104 88.1804 8.2221 10.2244 12.7654 3.9702 38.4784 40.4615 7.3837 6.0764 10.4619 7.4636 3.7608 9.6569 17.0384 8.6388 10.4122 12.0277 0.3902 2.6497 8.5789 2.3362 0.6758 1.5291 7.4425 30.8009 11.3807 1.6441 2.6612 2.1244 5.4384 8.1420 10.0137 3.4020 2.9886 1.9175 0.2825 4.1935 0.0101 0.0453 2.5441 1.4661 101.8181
temp: 353.000 k
press: 1.00000 atm
elementType: 6 6 6 6 6 1 1 1 7 6 6 8 8 7 6 6 6 1 6 6 6 6 1 46 6 1 6 1 6 6 6 6 1 6 6 1 1 6 6 1 1 1 6 6 1 6 1 6 1 1 1 6 6 6 6 1 6 6 1 1 9 9 6 7 7 6 6 6 6 6 1 6 1 6 6 1 6 1 1 1 7 46 7 8 6 8 6 1 1 6 6 1 1 1 8 7 1 6 1 6 1 1 6 8 8 6 1 1 6 1 1 1
symmnumber: 1
zpe: 2227821.8 jmol-1
zpe.correction: 0.848532 hartree
zpe.thermalcorrener: 0.935130 hartree
zpe.thermalcorrenthalpy: 0.936248 hartree
zpe.thermalcorrgfe: 0.712634 hartree
zpe.sumelectzpe: -3402.308521 hartree
zpe.sumelectthermal: -3402.221923 hartree
zpe.sumelectthermalent: -3402.220805 hartree
zpe.sumelectthermalfe: -3402.444419 hartree
dipole: 6.4175 2.3766 -6.1858
dipole: 9.2248
quadrupole: -473.3235 -363.1965 -433.9160
quadrupole: -36.7207 28.1205 1.1925
quadrupole: -49.8448 60.2822 -10.4373 -36.7207 28.1205 1.1925
hfenergy: -3403.1570533 hartree
pointgroup: C01 [X(C53H41F2N7O7Pd2)]
dipole: -2.5248489 -0.9350391 -2.4336801 debye
polarizability: 840.726673|-12.4470125|822.1025967|-7.034065|7.3378583|486.2536505 unknown
InChI: InChI=1S/C35H21F2N5O2.C9H6N.C5H8O2.C4H6NO3.2Pd/c1-20-22(24-10-3-12-28(36)26(24)18-38)8-5-14-30(20)41-34(43)32-16-7-17-33(40-32)35(44)42-31-15-6-9-23(21(31)2)25-11-4-13-29(37)27(25)19-39;1-2-6-9-8(4-1)5-3-7-10-9;1-3-5(6)7-4-2;1-3(6)5-2-4(7)8;;/h3-17H,1-2H3;1-3,5-7H;3H,1,4H2,2H3;5H,2H2,1H3;;/q-3;-1;;-1;+1;+4
charge 0 multiplicity 1
112 atoms
C  -5.664512 -2.597758 -0.568138
C  -4.254556 -4.236684 0.393862
C  -5.277792 -5.179712 0.37429
C  -6.524421 -4.789757 -0.132846
C  -6.732276 -3.4895 -0.611088
H  -5.0746 -6.181527 0.755999
H  -7.345302 -5.509902 -0.156343
H  -7.685696 -3.145672 -1.015329
N  -4.496848 -3.008278 -0.069725
C  -5.675037 -1.15709 -1.050848
C  -2.845465 -4.447069 0.923063
O  -2.509368 -5.527031 1.389525
O  -6.703096 -0.661354 -1.493092
N  -2.107766 -3.308426 0.825067
C  -0.804662 -3.210794 1.354346
C  0.697375 -1.949756 2.797704
C  1.55954 -3.705061 1.361134
H  0.859853 -1.171259 3.545424
C  -4.212832 0.764186 -1.284144
C  -4.770699 1.825075 -0.537798
C  -2.964653 2.327719 -2.660363
C  -4.406474 3.143015 -0.885256
H  -2.265682 2.521306 -3.476772
Pd -3.037272 -1.742996 -0.064176
C  1.769035 -2.693683 2.310271
H  2.780364 -2.505211 2.679653
C  -3.520416 3.386623 -1.944723
H  -3.25685 4.419098 -2.187669
C  2.750387 -4.463472 0.899712
C  2.84149 -5.853851 1.030047
C  3.85557 -3.775446 0.346952
C  3.995843 -6.53577 0.64295
H  1.995484 -6.395653 1.45736
C  5.008258 -4.479723 -0.037298
C  5.0928 -5.855497 0.108911
H  4.04824 -7.619547 0.765107
H  6.005512 -6.367369 -0.197971
C  0.269066 -3.979586 0.85761
C  -5.712911 1.499267 0.585922
H  -5.228426 0.814775 1.303034
H  -6.050659 2.389835 1.129507
H  -6.596691 0.979765 0.186606
C  3.799283 -2.366526 0.101346
C  -3.311665 1.022515 -2.325418
H  -2.883092 0.16675 -2.854987
C  -0.580493 -2.221224 2.324464
H  -1.446021 -1.656091 2.68077
C  0.021164 -4.99676 -0.219777
H  -0.344413 -5.942138 0.210084
H  -0.778161 -4.640719 -0.888059
H  0.920405 -5.193988 -0.819123
C  -4.932121 4.32943 -0.151434
C  -5.749895 5.26064 -0.79965
C  -4.574085 4.576078 1.193647
C  -6.217034 6.395305 -0.132062
H  -6.027392 5.077407 -1.839547
C  -5.05564 5.719308 1.845807
C  -5.876374 6.633328 1.199204
H  -6.860772 7.104807 -0.655915
H  -6.228356 7.509188 1.745535
F  6.016837 -3.80193 -0.56185
F  -4.703797 5.92523 3.106878
C  -3.702777 3.682253 1.901434
N  -2.996397 2.95345 2.464815
N  -4.450858 -0.580489 -0.923447
C  -0.386291 -0.60561 -0.88216
C  -1.515279 0.603471 0.767024
C  -0.363894 -1.690935 -1.796414
C  0.717789 0.291159 -0.821737
C  -0.440314 1.501499 0.920547
H  -2.424989 0.725937 1.363405
C  0.704727 -1.845418 -2.651827
H  -1.21304 -2.379822 -1.807468
C  1.809992 0.120867 -1.735236
C  0.681981 1.335796 0.139689
H  -0.528095 2.30137 1.656149
C  1.776055 -0.921843 -2.645198
H  0.718425 -2.678381 -3.358315
H  1.549333 1.995343 0.24466
H  2.594052 -1.040068 -3.361897
N  -1.477836 -0.419532 -0.072235
Pd 3.655132 0.664529 -0.964561
N  3.75143 -1.235602 -0.139427
O  5.371954 1.240476 -0.024372
C  5.025828 1.971696 0.978843
O  3.858226 2.124362 1.357601
C  6.163745 2.706368 1.673955
H  5.717554 3.538344 2.240558
H  6.656041 2.026335 2.386951
C  8.423835 2.59794 0.755958
C  9.284019 2.971333 -0.432568
H  8.970386 3.911786 -0.905889
H  10.328011 3.043611 -0.104742
H  9.218629 2.16432 -1.177513
O  8.823586 1.857068 1.638308
N  7.173676 3.146552 0.751486
H  6.844574 3.641915 -0.074889
C  3.700256 2.377303 -2.069489
H  4.589684 2.265304 -2.696854
C  2.457705 1.822549 -2.515902
H  1.550417 2.35381 -2.215276
H  2.433671 1.431201 -3.534533
C  3.792385 3.55924 -1.171763
O  4.833301 4.147155 -0.964326
O  2.627624 3.900162 -0.618592
C  2.661744 4.87246 0.433216
H  2.560273 5.871614 -0.019822
H  3.645196 4.816211 0.920258
C  1.547464 4.567928 1.405751
H  1.490819 5.354672 2.171216
H  0.574833 4.516169 0.893286
H  1.753371 3.610877 1.906688
