program: Gaussian 16
title: Title Card Required
version: ES64L-G16RevA.03
method: RMN15
basis: Gen
operation: Freq
keyword: #N
keyword: Geom=AllCheck
keyword: Guess=TCheck
keyword: SCRF=Check
keyword: GenChk
keyword: RMN15/ChkBas
keyword: Freq
converged: YES YES YES YES
title: Mulliken charges:
elementType: C C C C C H H H N C C O O N C C C H C C C C H Pd C H C H C C C C H C C H H C C H H H C C H C H C H H H C C C C H C C H H F F C N N C C C C C H C H C C H C H H H N Pd N C H C H H C O O C H H C H H H O C O C H H N C H C O H H H
charge: 0.079923 0.077045 -0.004112 0.088924 -0.004114 0.016716 0.017361 0.018346 -0.164272 0.150606 0.142490 -0.222379 -0.222477 -0.325579 0.040769 0.004289 -0.088916 -0.012625 0.047032 -0.047217 0.004529 -0.075450 -0.023386 0.101488 0.046101 -0.022670 0.041266 -0.031222 0.075273 -0.016947 -0.189643 0.058281 0.000294 0.270178 -0.049133 0.014195 0.012271 -0.023751 0.153450 0.024972 0.004033 0.050551 -0.110066 0.063708 -0.021892 0.057919 -0.009686 0.157637 0.044066 0.004615 0.007035 0.053754 -0.021403 -0.174679 0.055908 -0.007834 0.259245 -0.048201 0.008103 0.005874 -0.138100 -0.147373 -0.167441 0.109169 -0.330620 0.030464 0.117170 0.080241 0.138368 0.045399 0.057718 0.017118 0.013521 -0.262481 0.041550 0.010247 0.036155 -0.007562 0.027932 0.015277 -0.130986 -0.111331 0.211209 0.047396 0.068381 0.168858 0.063584 0.066135 0.223596 -0.219285 -0.268515 0.121948 0.052888 0.023001 -0.012489 0.029851 0.033785 0.026069 -0.380358 0.136102 -0.276573 0.181831 0.036674 0.049372 -0.178427 -0.009824 0.142557 0.058146 -0.266903 0.034563 0.009068 0.042335
chargesum: -0.00000
title: Mulliken charges with hydrogens summed into heavy atoms:
elementType: C C C C C N C C O O N C C C C C C C Pd C C C C C C C C C C C C C C C C C C C C F F C N N C C C C C C C C C N Pd N C C C O O C C O C O C N C C O
charge: 0.079923 0.077045 0.012604 0.106284 0.014232 -0.164272 0.150606 0.142490 -0.222379 -0.222477 -0.325579 0.040769 -0.008336 -0.088916 0.047032 -0.047217 -0.018858 -0.075450 0.101488 0.023431 0.010044 0.075273 -0.016653 -0.189643 0.072477 0.270178 -0.036862 -0.023751 0.233006 -0.110066 0.041816 0.048233 0.213352 0.053754 -0.029236 -0.174679 0.064012 0.259245 -0.042327 -0.138100 -0.147373 -0.167441 0.109169 -0.330620 0.030464 0.174888 0.093762 0.138368 0.055645 0.009556 -0.262481 0.069482 0.051432 -0.130986 -0.111331 0.211209 0.115776 0.298577 0.223596 -0.219285 -0.268515 0.197838 0.077216 -0.380358 0.136102 -0.276573 0.267876 -0.035871 -0.009824 0.144113 -0.266903
1716.lowfreq: -296.2792 -1.2375 -0.0021 -0.0013 0.0007 1.7871 2.3630 11.1051 12.1326
redmass: 7.8810 7.7338 6.0918 6.8667 6.7577 8.7825 6.9771 6.7836 7.4909 6.2123 4.1780 5.5177 6.7710 4.0733 5.6209 5.7801 5.3132 5.2352 2.2670 5.1038 2.4492 3.7588 6.4420 5.9995 5.1081 5.4888 6.6395 6.6702 8.2026 5.9901 6.8360 7.3655 6.0682 5.3807 4.3822 6.5457 5.4339 6.6225 5.6550 5.6515 3.9816 3.7325 4.0612 4.6438 5.3898 2.4134 4.2120 2.0433 1.8217 5.4177 2.6107 2.6051 3.9458 5.4987 3.9485 5.1942 5.2042 6.5627 4.6688 5.2270 2.3788 4.9196 5.6800 7.1476 5.9988 6.4836 6.4784 5.5212 5.0562 4.6250 4.7514 4.2860 8.5637 4.6920 4.0653 4.6029 7.2543 4.4193 6.5487 6.9163 6.4172 4.2361 4.4029 5.1103 4.7489 4.6710 9.6211 3.6263 3.9410 4.8560 4.3219 5.7031 4.4032 4.1370 5.7214 3.2533 3.5589 1.5810 4.8598 4.8132 6.4566 5.8112 6.4761 6.4649 6.9139 3.1988 4.7865 4.9784 5.2196 3.6616 6.2878 7.0587 2.5134 5.7011 5.4597 4.6232 5.6393 3.3362 5.6162 6.0729 5.9017 7.1974 3.3590 7.9868 6.7806 7.0338 2.0901 2.2276 5.5224 1.5060 2.1637 2.6136 2.8763 3.0797 4.5861 4.3588 1.9698 1.2026 4.8630 4.2999 4.4284 1.8984 4.1471 2.0272 1.7645 2.4828 2.2253 3.3069 2.5864 2.0003 2.4400 6.5913 1.9895 1.6032 3.3275 1.5046 1.4425 1.4099 1.6362 3.9513 1.7788 1.5598 2.2974 4.8799 1.8158 1.5755 1.9666 2.0614 2.8342 1.4166 2.8707 1.4883 1.6542 1.8974 1.3843 1.4371 1.4508 1.5157 1.3606 1.7636 1.3678 2.4889 2.4810 1.6053 1.6324 1.7179 1.6799 2.7025 1.8650 1.7809 1.7554 3.1210 1.3681 1.9086 1.2510 1.1299 1.2840 1.3233 1.2919 1.1725 1.2522 1.2715 1.7654 2.4198 3.2720 3.0222 1.6744 1.1837 1.8378 1.5029 2.3292 2.7274 2.5956 2.8656 2.3084 1.3674 2.1688 1.6032 1.9632 1.9051 2.1638 2.0240 3.3541 1.5065 1.3150 5.1184 6.6058 4.2703 3.6207 5.1586 1.4701 2.3741 1.4194 6.5020 1.6437 1.6229 4.3517 1.4735 2.3584 2.5748 1.4059 1.9497 1.2112 1.0610 2.4693 1.4871 1.1799 3.9891 1.0551 1.1166 6.8293 1.4706 1.1261 1.0744 1.1546 4.6929 3.7429 3.0622 3.1354 4.7621 4.9752 3.0538 4.8298 4.4645 5.5150 4.4657 4.4199 3.7737 4.8051 7.6554 7.7057 7.5807 6.9331 7.6510 7.8609 7.7275 7.9770 9.0473 7.4178 8.6265 8.3449 8.4261 12.5654 12.4450 12.5656 11.4538 10.8827 12.6749 12.7057 1.0429 1.0375 1.0379 1.0369 1.0649 1.0632 1.1006 1.0978 1.1010 1.0577 1.1042 1.1051 1.1037 1.1051 1.1022 1.0975 1.1041 1.1058 1.0897 1.0887 1.0921 1.0881 1.0917 1.0929 1.0921 1.0940 1.0886 1.0888 1.0974 1.0909 1.0990 1.0987 1.0954 1.0958 1.0975 1.0942 1.0973 1.0978 1.0962 1.1165 1.0784
irintensity: 66.0047 0.3726 0.1042 0.6482 0.3477 0.0672 0.2884 1.1478 0.7662 0.5587 1.9087 2.1184 0.3541 1.9235 2.6095 1.4986 0.5624 0.6613 0.4231 1.9291 3.6010 2.7374 1.3423 1.0663 11.8098 1.4080 0.9918 1.3114 2.2709 2.3478 0.9478 0.1759 0.7225 1.6913 4.6081 0.3200 2.7658 5.0302 1.1515 4.3478 2.7864 1.4944 5.2270 0.3674 1.1568 1.3287 0.1867 0.8768 5.5991 1.3516 7.1655 7.7642 4.3614 1.3808 0.5944 1.0700 1.8216 0.5501 1.2354 1.6539 2.0446 0.3053 0.6933 8.4066 0.4241 5.2173 6.7536 1.7410 19.9900 3.0596 16.0910 8.9329 5.4926 11.3650 1.0205 11.0271 6.5733 41.0784 5.2856 3.0299 1.3104 19.3719 6.8546 7.8597 3.4535 5.7239 4.8495 0.6903 6.5420 0.5727 3.0014 4.7946 3.1984 2.6608 8.8174 1.4905 31.1535 48.5436 0.7926 0.8629 1.0794 1.6822 5.6915 1.4413 12.8459 21.1720 7.8165 5.6314 1.1314 3.8046 0.6413 4.2075 5.1890 0.7447 1.5345 4.0697 1.5032 2.8065 2.9593 0.8973 1.4872 17.7030 7.4805 18.1123 0.5506 83.9871 21.1497 10.1574 3.0788 12.6139 7.5389 2.8894 11.5785 7.0338 4.0646 2.1538 18.5342 3.6979 1.8233 7.0641 6.8554 28.1144 15.2791 40.2795 36.3063 12.5294 21.9422 10.2626 1.4570 14.7793 11.7463 32.2087 7.5795 13.0719 38.6287 1.4765 0.6080 1.8831 2.6282 5.8743 12.1306 6.8574 2.7591 12.7341 0.8798 0.0469 4.1714 7.0938 23.6230 1.0601 14.2761 1.7034 3.7967 11.7957 2.0409 2.6870 0.8604 2.4595 1.5166 7.6783 0.4145 39.1531 9.6750 7.2479 0.5478 4.1911 1.4187 12.9795 2.0963 3.8893 2.1398 28.0805 5.0379 11.4006 10.1022 1.4603 8.6541 8.7515 4.1992 1.7872 4.7533 4.3245 2.8438 26.0219 6.8427 1.5027 3.4830 8.4907 7.2499 58.9656 6.9402 2.7936 1.0328 2.4342 4.6508 16.4967 16.3544 5.6828 2.1870 8.3430 296.6363 22.0025 4.9048 4.6900 134.1750 18.3072 32.9223 16.3225 11.2085 10.1600 22.2139 24.7175 20.4909 10.7956 10.6726 33.9649 29.9175 97.6814 3.5812 608.0694 20.5075 12.2591 20.0768 12.0392 14.3950 163.4264 153.3892 143.7885 8.4563 2.9398 2.9486 89.1449 13.8374 8.9474 7.9480 12.6025 5.2111 2.6622 40.6876 93.3047 322.3249 253.6117 78.3374 21.5016 35.0457 20.2119 27.1071 398.6960 52.0957 61.3001 106.7890 39.2134 2.6882 49.8042 62.6731 6.2013 45.5270 0.4588 25.1945 54.1558 117.2126 16.7797 542.0351 330.5311 395.6809 118.4682 369.1787 55.3266 87.4905 8.3978 9.7273 2.3049 16.2122 19.8510 13.7125 10.3212 7.8383 5.6373 3.2146 7.1215 9.9721 5.3872 13.5110 11.8325 56.1251 0.9835 7.8391 1.5546 2.5917 0.3925 0.2602 7.4233 7.1265 6.9814 2.0084 2.6126 2.0873 4.8543 7.7418 9.9246 4.6299 2.9963 1.8604 0.2786 4.2181 0.0218 0.0757 2.7846 2.5880 106.4487
temp: 353.000 k
press: 1.00000 atm
elementType: 6 6 6 6 6 1 1 1 7 6 6 8 8 7 6 6 6 1 6 6 6 6 1 46 6 1 6 1 6 6 6 6 1 6 6 1 1 6 6 1 1 1 6 6 1 6 1 6 1 1 1 6 6 6 6 1 6 6 1 1 9 9 6 7 7 6 6 6 6 6 1 6 1 6 6 1 6 1 1 1 7 46 7 6 1 6 1 1 6 8 8 6 1 1 6 1 1 1 8 6 8 6 1 1 7 6 1 6 8 1 1 1
symmnumber: 1
zpe: 2226497.6 jmol-1
zpe.correction: 0.848028 hartree
zpe.thermalcorrener: 0.935012 hartree
zpe.thermalcorrenthalpy: 0.936130 hartree
zpe.thermalcorrgfe: 0.711951 hartree
zpe.sumelectzpe: -3402.308002 hartree
zpe.sumelectthermal: -3402.221018 hartree
zpe.sumelectthermalent: -3402.219900 hartree
zpe.sumelectthermalfe: -3402.444079 hartree
dipole: -6.8786 -3.7406 -1.1369
dipole: 7.9120
quadrupole: -488.4381 -365.4491 -432.4725
quadrupole: -40.9259 13.6572 0.7771
quadrupole: -59.6516 63.3375 -3.6859 -40.9259 13.6572 0.7771
hfenergy: -3403.1560299 hartree
pointgroup: C01 [X(C53H41F2N7O7Pd2)]
dipole: -2.7062538 -1.4716696 -0.4473015 debye
polarizability: 838.3916899|6.3885271|833.4026804|-4.5749612|9.281571|489.5687139 unknown
InChI: InChI=1S/C35H21F2N5O2.C9H6N.C5H8O2.C4H6NO3.2Pd/c1-20-22(24-10-3-12-28(36)26(24)18-38)8-5-14-30(20)41-34(43)32-16-7-17-33(40-32)35(44)42-31-15-6-9-23(21(31)2)25-11-4-13-29(37)27(25)19-39;1-2-6-9-8(4-1)5-3-7-10-9;1-3-5(6)7-4-2;1-3(6)5-2-4(7)8;;/h3-17H,1-2H3;1-3,5-7H;3H,1,4H2,2H3;5H,2H2,1H3;;/q-3;-1;;-1;+1;+4
charge 0 multiplicity 1
112 atoms
C  -6.030237 -2.020923 -0.595609
C  -4.816934 -3.799346 0.386596
C  -5.930651 -4.632438 0.33977
C  -7.119511 -4.114764 -0.191425
C  -7.182459 -2.798452 -0.66664
H  -5.839518 -5.651444 0.719154
H  -8.009107 -4.74687 -0.236728
H  -8.086373 -2.357328 -1.089731
N  -4.922049 -2.550655 -0.074416
C  -5.882453 -0.58538 -1.071535
C  -3.447371 -4.156164 0.940449
O  -3.230944 -5.267807 1.4032
O  -6.843861 0.013546 -1.53523
N  -2.595596 -3.098199 0.86497
C  -1.296161 -3.140082 1.408199
C  0.312773 -2.055895 2.879221
C  1.004012 -3.877093 1.432291
H  0.54495 -1.307227 3.639043
C  -4.223323 1.176667 -1.25952
C  -4.682839 2.28732 -0.518597
C  -2.776966 2.603081 -2.589851
C  -4.16606 3.55964 -0.842819
H  -2.040133 2.724429 -3.386648
Pd -3.340994 -1.441611 -0.031455
C  1.306701 -2.902849 2.394976
H  2.327997 -2.827341 2.777383
C  -3.230433 3.711285 -1.876742
H  -2.847228 4.709813 -2.101457
C  2.114272 -4.750903 0.974219
C  2.058951 -6.144036 1.093543
C  3.290186 -4.177021 0.437217
C  3.140079 -6.939398 0.711314
H  1.156725 -6.598165 1.507796
C  4.368735 -4.994416 0.060644
C  4.307809 -6.372709 0.195207
H  3.077775 -8.023739 0.823382
H  5.165537 -6.974326 -0.107469
C  -0.302412 -4.011581 0.914045
C  -5.687627 2.058729 0.574611
H  -5.295916 1.332368 1.307096
H  -5.95296 2.979752 1.107485
H  -6.605344 1.628297 0.147024
C  3.383297 -2.7689 0.198125
C  -3.274073 1.341741 -2.27676
H  -2.928144 0.447894 -2.803875
C  -0.980887 -2.186993 2.389479
H  -1.786449 -1.537144 2.741864
C  -0.641856 -4.987683 -0.176222
H  -1.098044 -5.898645 0.240929
H  -1.400229 -4.549371 -0.843079
H  0.237094 -5.26307 -0.774924
C  -4.57775 4.792853 -0.113475
C  -5.252524 5.81939 -0.78232
C  -4.248667 4.985859 1.24774
C  -5.609122 6.99668 -0.120583
H  -5.506843 5.677922 -1.834598
C  -4.618005 6.173617 1.893666
C  -5.297504 7.18324 1.225922
H  -6.142209 7.78128 -0.661351
H  -5.565137 8.090951 1.768057
F  5.449672 -4.421289 -0.442959
F  -4.296413 6.327016 3.17022
C  -3.518568 3.991015 1.979905
N  -2.92746 3.179752 2.563099
N  -4.609316 -0.137255 -0.912591
C  -0.57698 -0.564354 -0.801693
C  -1.619345 0.751726 0.823881
C  -0.644239 -1.648767 -1.714108
C  0.600065 0.236589 -0.737078
C  -0.482083 1.571668 0.966147
H  -2.521112 0.953215 1.410796
C  0.40884 -1.894547 -2.567902
H  -1.550757 -2.26005 -1.729117
C  1.684896 -0.044425 -1.631526
C  0.62851 1.30912 0.195092
H  -0.519265 2.397565 1.676321
C  1.56017 -1.073887 -2.549524
H  0.350761 -2.722891 -3.277568
H  1.52272 1.938846 0.264556
H  2.374189 -1.268081 -3.254387
N  -1.65722 -0.279525 -0.004661
Pd 3.608025 0.233609 -0.914326
N  3.461413 -1.638741 -0.039815
C  3.842619 1.95994 -1.97999
H  4.682124 1.768139 -2.653604
C  2.512679 1.619715 -2.364871
H  1.711304 2.249773 -1.969058
H  2.367612 1.287983 -3.393993
C  4.068612 2.98925 -0.930354
O  3.225314 3.356357 -0.133486
O  5.316913 3.442871 -0.957496
C  5.720793 4.346169 0.078234
H  6.817486 4.286405 0.09888
H  5.323649 3.970883 1.034752
C  5.245245 5.757396 -0.19699
H  5.616703 6.107413 -1.170721
H  4.147796 5.803619 -0.191468
H  5.625994 6.437309 0.578514
O  5.397148 0.578605 -0.006696
C  6.421093 0.660903 -0.798889
O  6.439348 0.334262 -1.977213
C  7.668821 1.243998 -0.147327
H  8.491866 0.522019 -0.28122
H  7.954458 2.144667 -0.713804
N  7.457002 1.596005 1.234237
C  8.067255 2.664167 1.81101
H  6.667582 1.143095 1.688231
C  7.614227 2.985219 3.220115
O  8.898084 3.346291 1.228059
H  6.952621 3.864234 3.183449
H  7.077774 2.157276 3.702651
H  8.492251 3.260584 3.817568
