program: Gaussian 16
title: c7_BBONIA
version: ES64L-G16RevA.03
method: RMN15
basis: Gen
operation: Freq
keyword: #N
keyword: Geom=AllCheck
keyword: Guess=TCheck
keyword: SCRF=Check
keyword: GenChk
keyword: RMN15/ChkBas
keyword: Freq
converged: YES YES NO YES
title: Mulliken charges:
elementType: C C C C C H H H N C C O O N N C C C C H Pd C H C H N C C C C C H C H C C H C H H H H Pd O C O N C H H C C H H H O C H H H C C C C C C H C C H H H H H C C C H C C C H F N H C C C C H C C C H F N H
charge: 0.076039 0.066769 -0.001736 0.089776 -0.002180 0.017118 0.018421 0.022636 -0.162663 0.151348 0.153899 -0.217579 -0.203397 -0.329478 -0.335466 0.033667 -0.054634 0.010593 -0.059619 -0.020018 0.109534 0.039160 -0.026435 0.057851 -0.019100 -0.126331 0.010694 0.136375 0.089339 0.110054 0.080472 0.039384 0.021294 0.003458 0.010550 -0.067416 0.006231 0.055932 -0.002077 0.005840 0.180975 -0.002681 0.032690 -0.328408 0.192089 -0.224233 -0.334346 0.098088 0.043017 0.047311 0.094688 0.082527 0.048023 0.045168 0.043862 -0.291132 0.157065 0.060161 0.008120 0.005749 0.037590 -0.031721 0.066121 -0.090786 0.161819 0.003497 -0.024058 0.036366 0.054714 0.019432 0.005131 0.055990 -0.015985 -0.027504 -0.017086 -0.197543 0.065557 0.003030 0.281171 -0.091429 -0.051390 0.016483 -0.129403 0.224819 0.016254 0.083628 -0.032635 -0.173091 0.056042 -0.038015 0.254043 -0.212235 -0.050896 -0.002591 -0.148202 0.144351 0.001492
chargesum: -0.00000
title: Mulliken charges with hydrogens summed into heavy atoms:
elementType: C C C C C N C C O O N N C C C C Pd C C N C C C C C C C C C Pd O C O N C C C O C C C C C C C C C C C C C C C F N C C C C C C C F N
charge: 0.076039 0.066769 0.015382 0.108197 0.020456 -0.162663 0.151348 0.153899 -0.217579 -0.203397 -0.329478 -0.335466 0.033667 -0.054634 -0.009425 -0.059619 0.109534 0.012725 0.038752 -0.126331 0.010694 0.175759 0.092797 0.110054 0.086703 0.019217 0.016391 0.113559 0.053251 0.032690 -0.328408 0.192089 -0.224233 -0.334346 0.188416 0.094688 0.219580 -0.291132 0.231095 0.037590 -0.031721 0.042063 -0.090786 0.242371 -0.012487 0.008862 0.054714 -0.014057 -0.197543 0.082039 0.281171 -0.091429 -0.035135 -0.129403 0.224819 0.083628 -0.070650 -0.173091 0.053451 0.254043 -0.212235 -0.049404 -0.148202 0.144351
1716.lowfreq: -802.8294 -4.4879 -1.8104 -0.0014 -0.0010 -0.0007 3.4646 8.2454 17.1373
redmass: 1.3161 7.6807 9.1776 7.9879 7.3396 6.8742 6.3007 6.3317 6.8402 8.3609 6.8516 7.8022 8.4064 6.4309 5.8446 6.2786 6.1470 6.6059 8.6141 7.0831 6.3946 5.7536 7.1285 6.7653 4.1588 1.9409 5.4896 4.6278 7.1140 1.9169 4.4127 2.9860 8.5541 5.9804 4.8731 2.5874 4.7866 5.4244 4.9455 2.9450 3.5121 7.4516 5.9154 5.2306 4.6313 5.4568 5.3168 1.6852 2.5194 4.8957 6.2538 5.6435 6.6896 6.1450 7.2652 4.3561 5.1475 7.1422 5.7155 6.5222 6.8834 6.2720 6.1727 5.1953 5.0473 5.7183 6.6022 8.7977 5.3593 7.4565 6.1516 6.0214 4.3441 4.7698 6.7822 9.5644 4.0195 4.4500 3.4069 9.4119 3.9571 4.1102 3.9285 4.2397 6.9862 6.8418 6.2200 6.3373 4.2466 7.2469 2.6815 6.2294 6.7568 6.1478 5.1241 5.3457 5.7557 3.3963 3.9850 5.7147 5.9589 5.4892 4.2227 5.2797 5.7234 5.3516 7.1110 5.0072 7.9523 6.7756 2.2873 1.8708 6.0580 3.8646 2.4704 2.9028 1.9718 1.6828 6.6053 1.8605 3.9219 5.0363 4.4814 5.3792 2.0264 2.6294 2.1924 2.1644 2.3170 1.3192 4.6330 3.2489 2.9450 6.9599 1.7949 2.8118 1.5181 1.7317 1.6058 2.7372 1.6342 4.7753 1.4456 2.4129 1.4161 3.4903 2.9279 1.4574 2.9766 1.3540 1.4571 1.5959 1.8197 1.8859 1.6088 1.5851 1.3678 1.3479 1.7871 1.3830 2.0215 2.3810 1.3740 2.5245 1.6778 1.6543 1.8037 1.6981 1.9153 3.5018 1.1294 1.3798 1.3481 1.3007 1.1084 1.2273 1.3900 2.1860 2.5712 1.3784 1.1023 2.0728 2.4651 3.7682 2.5177 2.5876 2.1445 2.5058 1.9099 1.6361 1.9650 1.6050 1.8959 2.2080 1.7460 3.3983 5.0018 1.4395 6.3082 3.7773 4.8355 6.6882 3.7081 3.9969 2.2474 2.1943 1.5630 3.9963 4.0054 2.1299 1.1407 1.3134 1.1054 1.1677 3.0472 2.7650 1.0506 1.1363 1.0582 1.4680 4.3233 4.7074 3.4766 3.1219 5.1441 3.3241 5.2048 4.7612 4.4799 4.8961 4.3224 4.5588 6.1391 4.7428 7.0525 7.5666 8.0020 7.6544 7.8023 7.6784 7.9456 7.9492 9.0550 8.1130 8.2221 8.6600 7.0792 4.4231 12.8933 12.6815 12.8809 12.6736 12.7168 1.0414 1.0398 1.0602 1.0386 1.1056 1.1016 1.0972 1.1022 1.1020 1.1042 1.0897 1.0906 1.0910 1.0882 1.0911 1.0905 1.1057 1.0909 1.0923 1.0889 1.0943 1.0909 1.0934 1.0968 1.0989 1.0994 1.0957 1.0991 1.0971 1.0944 1.0975 1.0978
irintensity: 1633.1877 0.3039 0.8598 0.2691 0.7400 0.6381 0.8050 0.6417 1.7930 0.5886 0.8351 0.1112 1.4918 0.7242 2.8031 4.4310 2.3387 3.2244 1.8349 0.2084 2.2420 0.9199 3.8553 0.3749 0.6080 1.4768 0.4868 1.1247 2.5811 1.3592 1.7952 2.1549 1.2435 0.2290 0.2016 0.2817 1.7008 7.8873 1.5626 1.1957 2.2961 0.3515 2.0930 3.9690 0.5295 0.8954 0.5363 0.7011 4.4642 0.9614 3.2022 1.2851 2.4165 0.3530 17.9877 2.9742 2.6513 1.4902 13.8263 10.9170 3.8501 6.6869 8.8806 8.7485 6.2675 10.4426 2.8861 38.2274 0.8765 25.2750 9.4299 4.4712 1.6084 3.7761 16.2376 3.1112 2.7726 0.3080 0.4939 0.5949 1.1484 3.1500 0.5250 4.4382 2.2971 13.5792 6.6009 0.4308 3.0525 0.4775 3.9420 2.7549 13.8060 3.1748 1.1210 3.0659 1.3291 5.7539 1.9199 0.5673 4.5776 5.1203 0.0562 1.3206 4.8375 15.1265 17.9603 2.2615 16.7911 0.9635 15.4898 11.8621 12.8404 6.7946 17.2186 0.8003 0.8266 43.2320 1.4078 17.2998 4.6490 0.3025 4.9929 2.6426 21.8832 1.0317 26.4928 22.3249 18.3063 24.6006 17.2460 6.2210 13.9317 28.5106 0.2485 38.3126 14.1339 6.7952 9.2781 15.6107 5.8665 23.7309 0.6014 4.0527 0.0602 7.7274 10.1360 2.0106 33.6839 2.0146 0.4062 5.5522 3.9667 11.8277 2.1959 1.4188 0.7584 1.2333 7.9992 0.7470 3.3717 24.5253 0.7247 11.6329 1.0844 3.2942 4.4650 2.6501 3.2214 21.8237 1.7253 6.9999 8.7448 3.6718 3.8312 3.7179 8.1251 14.7170 8.9102 6.6373 2.1008 2.9906 7.0960 51.9329 0.6254 4.0539 6.6767 7.2726 12.4955 3.7620 0.3477 1.6106 16.5196 14.1622 2.5353 12.3148 19.4147 27.9184 1.8790 25.3366 6.1023 28.7643 271.5150 274.0309 82.7536 64.2861 14.1884 34.0799 47.1272 10.3266 177.6132 71.2075 29.0921 148.6780 230.6011 7.1445 19.6197 1.5483 33.3540 531.6430 8.9788 9.0594 14.6631 58.5218 144.7336 68.2486 117.6061 171.3126 33.4038 78.9294 10.5373 15.5441 105.7984 27.0690 7.9593 23.2905 9.8737 57.5100 22.3784 63.6713 33.9350 74.9791 0.1807 83.5825 33.4252 50.0953 3.4754 555.4189 516.6812 455.5162 848.8747 14.8137 104.2820 11.4021 11.9761 33.1952 1.8850 7.1849 11.2164 9.1744 1.9695 3.0565 10.9752 3.3294 0.8796 2.6093 1.3837 0.6456 1.0600 1.7899 4.8431 8.1486 1.8012 2.7556 7.3774 3.2824 0.4270 5.1259 6.7245 1.6827 6.7550 0.7409 4.8606 0.1425 0.1726
temp: 353.000 k
press: 1.00000 atm
elementType: 6 6 6 6 6 1 1 1 7 6 6 8 8 7 7 6 6 6 6 1 46 6 1 6 1 7 6 6 6 6 6 1 6 1 6 6 1 6 1 1 1 1 46 8 6 8 7 6 1 1 6 6 1 1 1 8 6 1 1 1 6 6 6 6 6 6 1 6 6 1 1 1 1 1 6 6 6 1 6 6 6 1 9 7 1 6 6 6 6 1 6 6 6 1 9 7 1
symmnumber: 1
zpe: 1880155.9 jmol-1
zpe.correction: 0.716114 hartree
zpe.thermalcorrener: 0.791302 hartree
zpe.thermalcorrenthalpy: 0.792420 hartree
zpe.thermalcorrgfe: 0.594826 hartree
zpe.sumelectzpe: -3057.298722 hartree
zpe.sumelectthermal: -3057.223533 hartree
zpe.sumelectthermalent: -3057.222416 hartree
zpe.sumelectthermalfe: -3057.420009 hartree
dipole: 2.2117 -5.7185 0.6008
dipole: 6.1607
quadrupole: -438.8937 -389.5087 -357.6654
quadrupole: 44.4633 -1.8742 -10.8972
quadrupole: -43.5378 5.8472 37.6905 44.4633 -1.8742 -10.8972
hfenergy: -3058.0148355 hartree
pointgroup: C01 [X(C48H33F2N7O5Pd2)]
dipole: 0.6396115 -2.3057911 0.3859637 debye
polarizability: 794.9395256|42.4120643|696.5902945|16.157657|8.9808681|485.7776219 unknown
InChI: InChI=1S/C35H21F2N5O2.C9H7N.C4H5NO3.2Pd/c1-20-22(24-10-3-12-28(36)26(24)18-38)8-5-14-30(20)41-34(43)32-16-7-17-33(40-32)35(44)42-31-15-6-9-23(21(31)2)25-11-4-13-29(37)27(25)19-39;1-2-6-9-8(4-1)5-3-7-10-9;1-3(6)5-2-4(7)8;;/h3-17H,1-2H3;1-7H;2H2,1H3;;/q-3;-1;-2;+2;+4
charge 0 multiplicity 1
97 atoms
C  -5.63941474 0.33239962 -0.27570503
C  -5.41971866 -2.00953652 -0.02719467
C  -6.79380039 -2.15832428 0.13483322
C  -7.59017656 -1.00625549 0.09502245
C  -7.01887995 0.25655384 -0.10878989
H  -7.19792387 -3.16017815 0.28816337
H  -8.67122584 -1.09393769 0.22390045
H  -7.60113874 1.17874932 -0.14718918
N  -4.91787247 -0.78989472 -0.22682108
C  -4.83440478 1.59444567 -0.54088222
C  -4.3871062 -3.1215869 -0.00427477
O  -4.73943845 -4.28751904 0.09076729
O  -5.38373423 2.68312807 -0.59179856
N  -3.5173965 1.30591161 -0.7281409
N  -3.11380155 -2.63121629 -0.07764751
C  -2.56569128 2.29307591 -1.07515251
C  -2.15291832 3.27931243 -0.15126112
C  -0.81719665 2.94281293 -2.63117158
C  -1.04417467 4.08771117 -0.49736098
H  -0.29740525 2.80978069 -3.58228433
Pd -3.0034651 -0.62686722 -0.42038254
C  -0.38031302 3.90132965 -1.72060978
H  0.49465382 4.51340429 -1.94979231
C  -1.91007582 2.14701041 -2.30536075
H  -2.25754617 1.35757232 -2.97808737
N  -0.99397413 -0.2968829 -0.56192698
C  -0.24165154 -0.68534802 -1.64015807
C  -0.49570367 0.53707594 0.3386227
C  -0.79092138 -1.56004547 -2.61202427
C  1.08048559 -0.18455548 -1.80489704
C  0.8091596 1.05547375 0.2525471
H  -1.16449586 0.82578277 1.15511979
C  -0.03707053 -1.92845655 -3.70343577
H  -1.81070774 -1.92520041 -2.4669191
C  1.82737682 -0.57854204 -2.9474091
C  1.61505813 0.68999666 -0.81147514
H  1.15970729 1.75241792 1.01701207
C  1.28065055 -1.43374659 -3.87693964
H  -0.46009105 -2.60641548 -4.44746748
H  2.83986709 -0.18135932 -3.06395464
H  2.43735151 1.58742669 -1.14508567
H  1.85780434 -1.73188852 -4.75422887
Pd 3.64221974 0.0791657 -0.27069927
O  5.36868096 -0.66975211 0.25924169
C  6.44823457 0.00984673 -0.06436048
O  7.57388348 -0.35004623 0.18088869
N  4.75586185 1.54126577 -0.95891462
C  6.17998947 1.32771525 -0.79348187
H  6.65818995 2.12886928 -0.20484786
H  6.71155309 1.28231484 -1.7596924
C  4.24117941 2.65297089 -1.46467588
C  5.16783959 3.75320458 -1.91426051
H  4.57661682 4.56311946 -2.35350147
H  5.74573163 4.1370365 -1.06037016
H  5.89066919 3.37448841 -2.65129717
O  2.99537151 2.81329424 -1.57874262
C  -2.84353797 3.34060142 1.18118628
H  -3.82885499 3.81983697 1.07488973
H  -3.03153756 2.31831672 1.5510707
H  -2.26254474 3.88905747 1.93435323
C  -2.02971423 -3.53434804 -0.12438338
C  -0.99124245 -3.46587585 0.83016458
C  -1.97745442 -4.49626946 -1.14641058
C  0.07622415 -4.38302544 0.72211785
C  -1.05765925 -2.51097929 1.99360836
C  -0.9065775 -5.37524512 -1.25334879
H  -2.80760303 -4.53841081 -1.85475226
C  0.1222949 -5.32365119 -0.31332967
C  1.08768256 -4.49676033 1.81367805
H  -0.98756716 -3.0551732 2.94885427
H  -0.2277175 -1.78576064 1.97935436
H  -2.00061525 -1.94846938 1.9828262
H  -0.87851119 -6.11225315 -2.05850944
H  0.9579202 -6.02608226 -0.36218133
C  0.9991363 -5.58512741 2.68900727
C  2.13796199 -3.57419229 2.01863076
C  1.90539969 -5.75124979 3.73894541
H  0.19282686 -6.30526229 2.53713385
C  3.03740146 -3.75349796 3.08670341
C  2.39704155 -2.45026589 1.1724823
C  2.93244825 -4.83262307 3.95092121
H  1.8074164 -6.61005345 4.40604788
F  4.00240206 -2.86687214 3.25251215
N  2.72997982 -1.52243658 0.56634007
H  3.65337961 -4.93332199 4.76289485
C  -0.44514052 5.08416104 0.43355335
C  0.9229155 4.99447812 0.73364102
C  -1.18282989 6.15158982 0.9940075
C  1.53559819 5.9093169 1.59079615
H  1.50914889 4.19525744 0.27183447
C  -0.54385702 7.05678674 1.85480277
C  -2.56484979 6.37939418 0.67827554
C  0.80372102 6.94717549 2.16739942
H  2.59997562 5.81257471 1.81470572
F  -1.25580772 8.04959478 2.36958297
N  -3.68056522 6.58357078 0.43349315
H  1.25225958 7.67672313 2.84278822
