program: Gaussian 16
title: Title Card Required
version: ES64L-G16RevA.03
method: RMN15
basis: Gen
operation: Freq
keyword: #N
keyword: Geom=AllCheck
keyword: Guess=TCheck
keyword: SCRF=Check
keyword: GenChk
keyword: RMN15/ChkBas
keyword: Freq
converged: YES YES YES YES
title: Mulliken charges:
elementType: C C C C C H H H N C C O O N N C C C H C C C C H Pd C H C H C C C C H C C H H C C H C H C C C C H C C H H N C C C C C H C H C C H C H H H H C N C N Pd O C O N C H H C C H H H O C H H H C H H H F F
charge: 0.066288 0.066755 0.001275 0.090876 0.001261 0.018733 0.019137 0.021483 -0.162272 0.159392 0.148454 -0.216216 -0.210254 -0.323116 -0.321610 0.020114 0.001558 -0.084876 -0.008687 0.045401 -0.045826 0.002368 -0.077293 -0.019178 0.092242 0.040507 -0.013967 0.037202 -0.032325 0.086427 -0.025575 -0.194013 0.060949 -0.002561 0.273019 -0.049901 0.014656 0.013414 -0.039573 0.045197 -0.026131 0.066988 -0.016739 0.065505 0.010732 -0.179153 0.077848 -0.068822 0.255174 -0.030055 -0.006932 -0.003922 -0.139980 0.022195 0.120975 0.095923 0.101104 0.053496 0.067856 0.074356 -0.007118 -0.019324 0.038508 0.004466 -0.095324 0.017267 -0.013592 0.005091 0.215687 -0.200687 0.136122 -0.117525 0.241718 0.052976 -0.331167 0.187492 -0.230849 -0.331047 0.098882 0.039341 0.046764 0.092341 0.077507 0.047009 0.044589 0.039796 -0.296063 0.165120 0.011039 0.032924 0.054747 0.162057 0.008832 0.047076 0.022459 -0.148318 -0.138682
chargesum: -0.00000
title: Mulliken charges with hydrogens summed into heavy atoms:
elementType: C C C C C N C C O O N N C C C C C C C Pd C C C C C C C C C C C C C C C C C N C C C C C C C C C C N C N Pd O C O N C C C O C C F F
charge: 0.066288 0.066755 0.020008 0.110012 0.022744 -0.162272 0.159392 0.148454 -0.216216 -0.210254 -0.323116 -0.321610 0.020114 -0.007129 -0.084876 0.045401 -0.045826 -0.016811 -0.077293 0.092242 0.026540 0.004877 0.086427 -0.028136 -0.194013 0.075605 0.273019 -0.036487 -0.039573 0.019066 0.050249 0.065505 -0.058090 -0.179153 0.070916 0.255174 -0.033977 -0.139980 0.022195 0.188831 0.088805 0.101104 0.057962 0.091624 -0.032916 0.043598 0.120363 -0.200687 0.136122 -0.117525 0.241718 0.052976 -0.331167 0.187492 -0.230849 -0.331047 0.184987 0.092341 0.208902 -0.296063 0.263830 0.240425 -0.148318 -0.138682
1716.lowfreq: -945.3135 -0.0003 0.0003 0.0005 2.1448 3.0594 5.0531 13.0073 15.6526
redmass: 1.2344 8.0036 9.1208 8.5359 9.1036 6.3586 6.7231 7.7479 6.6900 7.4547 6.0728 9.1997 7.7508 6.1995 5.0193 5.3371 5.8787 6.3002 7.7144 7.9002 6.7424 6.2610 6.6262 5.6424 3.7113 2.4879 4.8445 2.7775 3.7648 5.3866 2.6586 5.5734 5.8538 3.7141 7.1350 4.9219 5.4417 4.9627 5.3838 4.5459 4.1957 2.6602 2.6408 3.1481 3.2023 2.6968 5.3345 4.8856 4.2985 4.6973 5.4887 7.1311 5.4189 8.3047 6.3045 6.0593 4.7108 6.3104 7.3126 5.5184 7.9059 6.0211 5.4630 4.4117 6.4899 5.1541 5.7833 4.6545 7.9111 3.6335 8.6276 6.3112 5.0639 9.2870 4.7986 9.4411 4.0462 4.3606 10.0979 4.3356 3.1595 5.3477 3.3362 3.3861 6.9335 4.2707 6.9887 7.0633 7.2291 4.6062 3.0495 6.9187 4.8827 5.9767 5.9486 6.4531 5.5650 3.4247 3.8071 5.5134 5.9781 6.2043 6.2754 5.3233 3.8853 5.8660 7.0889 4.4546 7.9148 6.8322 2.2264 1.9496 3.8184 5.4649 2.2068 2.2143 4.2484 6.8792 1.5640 1.9196 4.1066 4.7999 4.1572 4.4330 2.0088 2.2566 2.0401 2.4695 2.2589 3.8972 5.0307 1.8236 2.3972 6.8565 2.2223 1.5934 1.4665 1.4604 1.6231 1.5994 2.8041 1.7646 4.9129 5.2161 2.5916 1.4143 2.2707 1.4381 2.9239 1.3819 1.5338 1.5527 1.7683 1.4142 1.6327 1.8472 1.6304 1.3979 1.3627 1.8819 2.1554 1.3721 2.4436 1.6768 1.8414 1.8397 2.0033 1.7549 1.9356 3.0774 1.1291 1.2693 1.3293 1.4519 1.1338 1.2111 1.2385 2.3239 2.0729 1.3747 1.1051 2.2021 3.4156 2.6336 2.4003 2.8439 2.3569 3.1277 1.6678 1.8726 1.9239 1.5083 1.8761 2.0787 1.6520 3.3756 5.7053 1.3646 6.4748 4.5194 3.7325 6.7551 6.6263 4.4453 2.4513 1.7152 1.6445 1.4998 4.0228 4.4236 1.6167 1.1209 1.7445 1.1264 1.2213 1.6167 1.0741 1.1712 2.5570 1.0771 4.9270 4.8376 3.9644 3.2977 3.3399 4.7123 4.1577 5.1810 5.4260 4.3820 4.5931 4.4302 7.8454 4.8185 7.2315 7.5044 7.5630 7.0529 7.7282 7.5448 7.9738 8.1728 9.0096 8.4477 8.5036 8.3506 7.7348 5.8242 12.9259 12.9080 12.8653 12.6732 12.7151 1.0604 1.0397 1.0385 1.0384 1.1053 1.1020 1.1004 1.1021 1.1039 1.1016 1.0922 1.0877 1.0897 1.0887 1.0921 1.1058 1.0926 1.0931 1.0878 1.0939 1.0953 1.0889 1.0910 1.0993 1.0952 1.0989 1.0954 1.0943 1.0976 1.0979 1.0969 1.0978
irintensity: 2315.9850 0.4767 0.7906 0.8358 0.0922 0.4796 1.3020 1.2542 1.5561 3.6805 0.5722 0.8233 0.1508 0.6365 3.0293 0.8849 5.7200 2.0345 0.4302 3.2406 1.8803 0.7964 0.3862 0.6084 0.5509 0.9362 0.7542 0.9416 1.6323 1.0995 1.6243 2.4817 1.2252 1.5503 4.0259 1.3226 5.4912 0.0636 2.2022 1.6783 3.4012 0.1919 1.1271 3.1304 1.8460 1.9733 2.1243 1.3672 1.6403 0.1518 1.0062 10.9683 1.3899 5.0301 12.5268 1.8224 6.4940 14.2831 11.7551 3.9679 6.0780 0.8377 8.1738 1.2080 11.1104 6.5469 0.8629 7.9255 48.0195 2.8965 16.6864 4.7517 3.1368 14.4199 4.3026 2.9060 3.7557 0.7332 2.6664 1.9575 13.0975 1.4830 3.5695 1.1514 6.9988 3.0967 0.6998 2.1479 2.3039 15.8216 6.0899 1.0299 4.2845 4.7007 1.5150 2.4848 0.3544 5.3395 2.4888 2.9284 3.7220 6.6608 3.3978 1.7869 6.1058 1.8658 20.2354 5.6584 14.8584 1.1730 9.8045 7.8724 14.4724 9.0304 11.1608 23.8869 5.3160 2.8921 6.7660 19.7036 11.5963 2.1572 0.4390 1.0822 2.8275 51.5166 6.4812 10.9739 18.8741 12.7625 9.9994 40.6788 8.9487 30.3896 23.7871 5.5101 4.0082 6.1105 16.9979 8.3750 26.6622 11.2325 23.9974 5.5384 3.6108 0.0625 3.2859 0.6931 38.6897 2.5337 2.2375 5.9817 3.3233 0.5766 2.5315 6.7757 2.7247 1.7674 1.4339 6.1435 15.9112 0.3665 10.4939 1.2327 12.0708 21.7560 3.7013 4.4989 7.9594 16.8648 2.3397 8.2883 5.6429 9.2343 4.6776 0.6735 1.6627 20.4133 6.4805 13.9739 3.0131 6.4042 35.1439 30.0706 1.9832 2.3620 3.8279 3.6962 2.3800 4.0422 1.6584 7.5631 11.1382 15.0028 3.1963 11.5442 18.4880 2.8301 24.7075 25.2373 11.9964 19.7451 7.7909 806.6270 84.5820 58.4804 208.9194 345.8388 41.4684 18.2792 310.6015 46.0961 193.3370 4.1888 24.1955 163.2978 5.9369 14.2605 17.4762 9.2172 0.8559 17.4873 4.3552 22.5149 16.0920 81.1544 296.9950 117.0790 20.0360 0.3952 10.3491 31.4917 67.7541 34.3614 28.6933 8.7082 124.3150 4.8209 49.5136 12.9017 26.9540 54.3804 0.5484 34.2656 69.4220 75.3692 35.9082 494.6565 491.3081 521.0441 944.7488 19.2845 58.0192 36.5996 13.7075 5.5851 2.7309 8.2236 11.4130 3.6600 1.9419 6.6628 3.4845 3.2786 1.7102 1.2931 0.5612 1.4062 3.2040 8.7191 0.2339 1.7400 4.5890 1.1220 2.4778 7.0134 9.4574 6.2961 2.8424 1.5359 5.2412 0.0730 0.2411 0.3763 0.1234
temp: 353.000 k
press: 1.00000 atm
elementType: 6 6 6 6 6 1 1 1 7 6 6 8 8 7 7 6 6 6 1 6 6 6 6 1 46 6 1 6 1 6 6 6 6 1 6 6 1 1 6 6 1 6 1 6 6 6 6 1 6 6 1 1 7 6 6 6 6 6 1 6 1 6 6 1 6 1 1 1 1 6 7 6 7 46 8 6 8 7 6 1 1 6 6 1 1 1 8 6 1 1 1 6 1 1 1 9 9
symmnumber: 1
zpe: 1880414.8 jmol-1
zpe.correction: 0.716212 hartree
zpe.thermalcorrener: 0.791227 hartree
zpe.thermalcorrenthalpy: 0.792345 hartree
zpe.thermalcorrgfe: 0.596471 hartree
zpe.sumelectzpe: -3057.298985 hartree
zpe.sumelectthermal: -3057.223970 hartree
zpe.sumelectthermalent: -3057.222852 hartree
zpe.sumelectthermalfe: -3057.418727 hartree
dipole: -1.6131 -4.8837 7.2388
dipole: 8.8799
quadrupole: -447.6538 -398.3351 -359.3948
quadrupole: 56.5934 18.5011 -18.7878
quadrupole: -45.8592 3.4594 42.3998 56.5934 18.5011 -18.7878
hfenergy: -3058.0151975 hartree
pointgroup: C01 [X(C48H33F2N7O5Pd2)]
dipole: -0.6403182 -1.921831 2.8463822 debye
polarizability: 811.7753356|36.9379134|609.6438151|2.8109683|-14.1845831|538.2202656 unknown
InChI: InChI=1S/C35H21F2N5O2.C9H7N.C4H5NO3.2Pd/c1-20-22(24-10-3-12-28(36)26(24)18-38)8-5-14-30(20)41-34(43)32-16-7-17-33(40-32)35(44)42-31-15-6-9-23(21(31)2)25-11-4-13-29(37)27(25)19-39;1-2-6-9-8(4-1)5-3-7-10-9;1-3(6)5-2-4(7)8;;/h3-17H,1-2H3;1-7H;2H2,1H3;;/q-3;-1;-2;+2;+4
charge 0 multiplicity 1
97 atoms
C  -5.8088892 -0.37339194 -0.96254261
C  -4.83090356 -2.26177737 -1.98807107
C  -6.01381752 -2.55785782 -2.65806323
C  -7.11713934 -1.72106792 -2.44892368
C  -7.02615293 -0.61856222 -1.59029176
H  -6.03692784 -3.42788203 -3.31617411
H  -8.05942823 -1.93188384 -2.95932846
H  -7.85904944 0.0577915 -1.39112037
N  -4.77919091 -1.19275864 -1.19172173
C  -5.51345647 0.77385749 -0.01459737
C  -3.53878306 -3.04607611 -2.0733054
O  -3.43583637 -3.98044523 -2.85390821
O  -6.39156156 1.56005943 0.30125563
N  -4.2025123 0.77854712 0.3569791
N  -2.60135828 -2.57521507 -1.19907082
C  -1.28950615 -3.09142181 -1.2605312
C  0.73853664 -3.43444149 -2.56049603
C  0.72086507 -3.90847711 -0.18474105
H  1.26530998 -3.4050282 -3.51627098
C  -3.68476788 1.79550218 1.18958523
C  -2.60671952 2.58339082 0.72315952
C  -3.54581751 2.84103706 3.37556398
C  -1.97561889 3.45982983 1.63170656
H  -3.92490928 2.95933897 4.39296906
Pd -3.13383347 -0.84841439 -0.23477746
C  1.40706608 -3.83460269 -1.40411998
H  2.46058407 -4.12304757 -1.44867892
C  -2.43493763 3.56888314 2.95282686
H  -1.92764187 4.25529223 3.63549594
C  1.47119121 -4.39205697 1.00557172
C  1.08397835 -5.53752142 1.71054645
C  2.64038078 -3.7214017 1.43417668
C  1.82487457 -5.99981756 2.79915966
H  0.20050684 -6.08466126 1.37827186
C  3.37202662 -4.19994265 2.53413327
C  2.97627921 -5.33428266 3.22466308
H  1.50565994 -6.90284085 3.32342025
H  3.57212065 -5.67726648 4.07113333
C  -0.64344477 -3.55134732 -0.09357164
C  -4.16491624 1.95491234 2.49609403
H  -5.02710299 1.36042811 2.8068422
C  -0.59937268 -3.06970737 -2.4850295
H  -1.14059931 -2.74505203 -3.3758284
C  -0.77715346 4.2467989 1.2212715
C  0.46574739 3.98079696 1.80603253
C  -0.84568157 5.24616991 0.22521973
C  1.62369766 4.6300474 1.37366594
H  0.51814776 3.22183401 2.58886772
C  0.32760961 5.89729653 -0.18278607
C  1.56469546 5.58894506 0.36496965
H  2.59154138 4.36951339 1.80669331
H  2.45542313 6.09254806 -0.01100558
N  -1.53050129 -0.43700551 1.00036302
C  -0.27991739 -0.03878383 0.60671661
C  -1.85687324 -0.41014053 2.28577143
C  0.0814393 -0.05423443 -0.76653474
C  0.65600601 0.43533659 1.57284042
C  -0.97804493 0.0136492 3.30137609
H  -2.87723761 -0.71941823 2.52994249
C  1.31798921 0.40476059 -1.15454228
H  -0.65119484 -0.41851123 -1.49052124
C  1.91711133 0.91310478 1.13089624
C  0.27684696 0.44370964 2.93824487
H  -1.31734152 0.01699197 4.33702759
C  2.27108267 0.89776888 -0.20764533
H  1.58226093 0.39953917 -2.21537857
H  2.61636816 1.30154972 1.87918984
H  0.989593 0.80545329 3.68487187
H  3.02666402 1.87507989 -0.55111833
C  -2.08930876 5.62201801 -0.38541147
N  -3.09001924 5.92707349 -0.88781742
C  3.10862293 -2.53800195 0.78140543
N  3.51585444 -1.5804379 0.27726264
Pd 4.26355004 0.08624658 -0.56010715
O  5.96446443 -0.82684434 -0.90324562
C  6.88836301 -0.15491238 -1.55243458
O  7.96012031 -0.6085477 -1.87627118
N  5.1953278 1.61239102 -1.37400904
C  6.51355145 1.29105182 -1.88515672
H  7.29828117 1.93585178 -1.45498618
H  6.57571206 1.40275836 -2.98167032
C  4.70051032 2.8394414 -1.37503132
C  5.51396334 3.9648369 -1.96112423
H  6.43259319 4.11622013 -1.3746951
H  5.82023697 3.72944504 -2.99049903
H  4.91625889 4.88224431 -1.95093056
O  3.56163212 3.09607753 -0.89483669
C  -2.16526413 2.47469576 -0.71117947
H  -1.10683393 2.74148654 -0.8411832
H  -2.31912034 1.45800167 -1.09938824
H  -2.76572727 3.14724938 -1.3447654
C  -1.39788153 -3.65906792 1.20670092
H  -0.80077077 -3.29701946 2.05841369
H  -2.33548013 -3.09036107 1.15850928
H  -1.67263714 -4.70333564 1.42303064
F  0.24036018 6.82477042 -1.12597421
F  4.45321965 -3.53544343 2.9086024
