program: Gaussian 16
title: Title Card Required
version: ES64L-G16RevA.03
method: RMN15
basis: Gen
operation: Freq
keyword: #N
keyword: Geom=AllCheck
keyword: Guess=TCheck
keyword: SCRF=Check
keyword: GenChk
keyword: RMN15/ChkBas
keyword: Freq
converged: YES YES YES YES
title: Mulliken charges:
elementType: C C C C C H H H N C C O O N C C C C C C C H Pd C H C H C C C C H C C H H C C C C H C C C C H C C H H F F N C C C C C H C H C C H C H H H H N Pd N O C O N C H H C C H H H O C H H H C H H H H H C N
charge: 0.076018 0.077737 -0.002872 0.090817 -0.000548 0.017561 0.019346 0.023826 -0.163412 0.146417 0.135855 -0.221097 -0.201243 -0.319169 0.040888 0.003636 -0.086661 0.033160 -0.057361 0.005893 -0.064822 -0.014427 0.135728 0.048279 -0.020183 0.027728 -0.030530 0.060781 -0.012845 -0.192756 0.058828 0.004748 0.274949 -0.048722 0.015592 0.013899 -0.058328 -0.100455 0.055696 0.059840 -0.018417 0.075071 -0.032517 -0.169369 0.057898 -0.038330 0.255759 -0.050101 0.001340 0.004805 -0.134717 -0.145655 -0.325572 0.034112 0.132505 0.110496 0.097693 0.052033 0.048808 0.030918 -0.019926 0.008236 0.039833 0.001356 -0.091210 0.001104 -0.008017 0.000281 0.249488 -0.141997 0.062732 0.218111 -0.332435 0.174644 -0.232003 -0.315319 0.109568 0.046261 0.037124 0.081414 0.059009 0.040410 0.058005 0.044833 -0.293690 0.158695 0.044888 0.020679 0.008160 0.157239 0.061852 0.010737 0.007345 -0.012590 -0.016835 -0.205258 0.148726
chargesum: -0.00000
title: Mulliken charges with hydrogens summed into heavy atoms:
elementType: C C C C C N C C O O N C C C C C C C Pd C C C C C C C C C C C C C C C C C C F F N C C C C C C C C C N Pd N O C O N C C C O C C C N
charge: 0.076018 0.077737 0.014690 0.110163 0.023278 -0.163412 0.146417 0.135855 -0.221097 -0.201243 -0.319169 0.040888 -0.013199 -0.086661 0.033160 -0.057361 -0.008533 -0.064822 0.135728 0.028096 -0.002803 0.060781 -0.008097 -0.192756 0.074420 0.274949 -0.034822 -0.058328 -0.100455 0.043107 0.041423 0.075071 -0.070847 -0.169369 0.059238 0.255759 -0.045296 -0.134717 -0.145655 -0.325572 0.034112 0.181312 0.090570 0.097693 0.053389 0.032021 0.000219 0.040115 0.158278 -0.141997 0.062732 0.218111 -0.332435 0.174644 -0.232003 -0.315319 0.192953 0.081414 0.202257 -0.293690 0.232422 0.237172 -0.205258 0.148726
1716.lowfreq: -994.6314 -1.3156 -0.0010 -0.0006 0.0007 1.1167 2.2452 10.9430 14.7112
redmass: 1.1971 8.2918 8.6754 8.0808 7.6452 8.0901 7.2499 8.0366 6.4280 7.3271 8.5826 6.7737 5.7115 6.6944 6.0540 5.6577 5.1284 5.5747 5.8363 7.4760 7.0638 7.9509 7.6380 6.3680 6.4297 5.9134 7.5122 1.6464 2.5536 6.0908 7.1982 5.7324 6.2593 5.8659 4.5446 6.2963 5.2637 4.6418 6.0480 3.9226 6.2348 4.3358 5.0216 4.9711 3.8436 3.7580 2.5624 2.5977 1.3609 5.0109 5.3517 5.9831 5.8613 5.0486 5.2181 4.2163 5.3232 5.7774 6.9279 6.8586 8.1368 6.5258 6.2130 3.8108 7.3008 4.2503 6.5801 6.1766 5.4451 4.0145 6.5241 6.2253 6.5150 5.0073 7.8923 9.8729 4.0251 4.6339 7.4603 4.9577 3.4487 3.5530 3.7273 4.3845 4.6543 6.6609 6.0949 6.6636 6.3697 5.1932 2.8952 6.1697 6.6175 6.7638 5.1887 3.8162 4.3994 7.0288 3.6045 5.6335 5.8401 6.5347 6.1236 4.7455 4.1322 5.6844 7.5693 4.6162 7.8268 6.8534 2.5709 2.1093 6.2585 3.3451 2.1900 2.1448 3.9752 6.9398 1.6035 1.9050 4.0089 4.8791 4.2959 4.1847 1.9201 2.0435 1.9015 2.4821 2.2845 4.4525 5.5293 1.7073 2.3921 6.7661 3.3191 1.6631 1.4909 2.7458 1.4197 4.5980 1.6232 1.8064 1.5440 5.3221 2.0924 1.4404 2.1171 1.4320 3.0915 1.4810 1.7557 1.5109 1.4413 1.3897 1.8612 1.5099 1.4499 1.4647 1.3635 1.7767 1.3715 2.5007 2.4531 1.7225 1.8912 1.6597 2.0011 1.7204 1.7013 3.4562 1.1298 1.2555 1.2801 1.2967 1.1411 1.2500 1.2641 2.5512 2.9940 1.1730 1.8205 2.3367 2.8801 2.7056 2.4790 2.3484 2.2585 3.2264 1.7277 1.7588 1.6159 1.9163 1.5965 2.0529 1.5546 3.4104 5.0750 1.3679 6.0827 1.6551 4.4468 3.9673 3.4516 4.5414 6.5364 1.7025 2.4673 1.6390 4.7154 4.4789 1.9478 1.0596 1.0990 1.0780 1.1580 5.3107 1.1375 1.1329 1.1426 2.1481 4.9874 4.7255 3.6458 3.1831 3.0805 4.7682 4.5285 5.4799 5.2299 4.3406 4.5039 4.4115 8.3492 4.8569 6.9516 7.5441 7.6050 7.3558 7.4001 7.8517 7.8575 8.0441 9.0515 8.4006 8.2991 8.6439 7.5281 5.8966 12.5383 12.6124 12.8797 12.6735 12.7146 1.0420 1.0392 1.0628 1.0388 1.1029 1.0960 1.0990 1.1017 1.1047 1.1044 1.0921 1.0893 1.0890 1.0881 1.0916 1.0926 1.0891 1.1059 1.0913 1.0969 1.0934 1.0892 1.0909 1.0988 1.0942 1.0989 1.0958 1.0986 1.0973 1.0945 1.0973 1.0978
irintensity: 2170.6411 0.0460 0.6009 1.4643 1.0074 0.4114 1.4785 1.7835 1.5613 0.5873 0.1825 3.4156 3.1548 0.2187 2.2966 2.5005 1.2243 0.5713 0.9988 0.2368 0.4702 1.8944 3.5180 0.6009 0.5191 1.1004 1.9190 1.5813 2.1790 0.4785 2.5111 2.1506 1.0781 0.0577 0.4280 2.1853 1.1600 1.5600 5.2710 1.0578 5.5588 0.6218 1.9562 0.6668 2.2268 1.3671 2.3110 1.8928 3.4295 2.5103 1.8488 2.1344 2.7416 14.2585 1.7335 4.9631 2.0319 12.0344 21.0613 0.4940 9.9690 7.2259 2.7123 0.7999 9.7196 11.5122 1.7425 20.4088 32.2624 2.0465 5.2134 11.7621 2.8090 9.9557 6.2373 3.7046 3.9179 0.1590 3.2946 1.5337 5.9770 6.5541 5.3785 4.3277 0.2197 0.7469 1.3471 9.3030 2.0431 12.4242 3.0891 4.8299 5.3434 9.9855 0.2537 0.4135 3.0029 1.9774 5.2914 1.5771 0.7165 3.9090 11.0166 4.0152 2.0071 0.9315 13.0788 7.2772 15.9363 1.8923 14.9162 8.4298 16.4368 9.9502 9.1689 14.9502 8.7113 1.2731 4.2235 20.2473 3.2995 3.4653 4.0025 9.2838 11.5813 56.9764 6.5528 8.0540 22.1411 7.1773 8.9617 33.5578 13.6482 55.4858 16.6041 2.9628 2.4934 27.7864 2.2199 20.1692 12.9010 20.7057 1.2959 3.5586 1.5827 0.0681 10.4663 0.9811 24.4682 1.1641 4.8585 3.9705 0.9099 0.5234 8.7774 2.0659 1.6301 0.9150 1.5310 5.9649 0.4709 20.9528 12.6186 4.0411 14.2215 3.6495 0.7861 1.4265 4.5358 22.8566 1.3708 4.2867 12.9987 9.5367 2.6525 2.6932 5.4797 32.9895 3.8019 8.7693 3.0177 6.7494 38.5840 2.0626 1.2480 13.5022 5.3486 5.4029 1.1752 6.1273 5.0547 9.9172 102.8490 35.8798 5.6106 1.4412 32.4545 50.4804 10.9352 833.8308 15.7181 38.7159 409.4340 24.6280 20.5794 23.6356 191.2261 3.8466 35.5560 24.7211 1.1767 22.6145 12.0819 15.8807 28.6533 269.2549 17.6935 4.4384 2.5549 46.9940 1.6586 5.2528 5.6701 67.6838 0.1842 70.8806 346.6909 27.0128 110.7735 3.8129 11.7599 20.7836 90.8690 31.2575 21.5704 30.7424 72.6411 35.4543 21.9089 80.4203 8.8392 81.7752 0.2883 30.3046 73.7703 58.3262 35.8785 421.5790 452.9846 416.5091 933.7453 12.3224 73.1590 11.6725 10.7192 34.1572 1.8828 9.4725 11.0327 9.5644 2.9220 8.3293 11.4323 1.6722 0.0978 2.8242 0.0771 8.4969 7.8151 3.6536 2.0401 0.0772 3.1999 1.1633 1.5388 6.7281 6.6139 5.5048 7.1207 1.9243 1.5321 0.4405 5.3093 0.0474 0.2144
temp: 353.000 k
press: 1.00000 atm
elementType: 6 6 6 6 6 1 1 1 7 6 6 8 8 7 6 6 6 6 6 6 6 1 46 6 1 6 1 6 6 6 6 1 6 6 1 1 6 6 6 6 1 6 6 6 6 1 6 6 1 1 9 9 7 6 6 6 6 6 1 6 1 6 6 1 6 1 1 1 1 7 46 7 8 6 8 7 6 1 1 6 6 1 1 1 8 6 1 1 1 6 1 1 1 1 1 6 7
symmnumber: 1
zpe: 1881569.3 jmol-1
zpe.correction: 0.716652 hartree
zpe.thermalcorrener: 0.791429 hartree
zpe.thermalcorrenthalpy: 0.792547 hartree
zpe.thermalcorrgfe: 0.596070 hartree
zpe.sumelectzpe: -3057.297649 hartree
zpe.sumelectthermal: -3057.222872 hartree
zpe.sumelectthermalent: -3057.221754 hartree
zpe.sumelectthermalfe: -3057.418231 hartree
dipole: 0.3412 2.6041 3.1930
dipole: 4.1343
quadrupole: -477.8940 -337.3232 -390.9720
quadrupole: -53.1162 49.9860 -15.4508
quadrupole: -75.8309 64.7398 11.0911 -53.1162 49.9860 -15.4508
hfenergy: -3058.0143008 hartree
pointgroup: C01 [X(C48H33F2N7O5Pd2)]
dipole: 0.1342918 1.0245299 1.2562057 debye
polarizability: 836.9279333|10.9518785|757.2308507|9.4795764|-52.1357119|424.9954377 unknown
InChI: InChI=1S/C35H21F2N5O2.C9H7N.C4H5NO3.2Pd/c1-20-22(24-10-3-12-28(36)26(24)18-38)8-5-14-30(20)41-34(43)32-16-7-17-33(40-32)35(44)42-31-15-6-9-23(21(31)2)25-11-4-13-29(37)27(25)19-39;1-2-6-9-8(4-1)5-3-7-10-9;1-3(6)5-2-4(7)8;;/h3-17H,1-2H3;1-7H;2H2,1H3;;/q-3;-1;-2;+2;+4
charge 0 multiplicity 1
97 atoms
C  3.7666809 3.57082122 -1.27840396
C  1.93759977 4.76142104 -0.37594315
C  2.50027015 5.97920149 -0.74536935
C  3.73668129 5.96189808 -1.40354857
C  4.38742783 4.75172348 -1.6742604
H  1.96278606 6.89780221 -0.50498013
H  4.20141135 6.90351876 -1.70392293
H  5.35512856 4.68931552 -2.17485639
N  2.58312752 3.6298153 -0.66413342
C  4.31598573 2.16883727 -1.46491969
C  0.62734992 4.56942036 0.35928895
O  -0.05215359 5.53714359 0.6744561
O  5.39876366 1.99362925 -2.00040827
N  0.37141747 3.25222721 0.5997721
C  -0.82985128 2.86278842 1.22195624
C  -1.89873865 1.52149425 2.94983953
C  -3.24191923 2.69224266 1.30926184
C  3.76170047 -0.14794966 -1.03454597
C  4.82414572 -0.69177029 -0.27773718
C  3.02300842 -2.36879746 -1.68606379
C  4.96305794 -2.09764647 -0.24561414
H  2.33140351 -3.01365129 -2.23217987
Pd 1.79644379 1.9621673 -0.08110535
C  -3.14757987 1.84880074 2.42487519
H  -4.06096307 1.47215591 2.89292236
C  4.05966633 -2.92058719 -0.93529381
H  4.19115678 -4.00450094 -0.8880312
C  -4.5985177 3.07193575 0.83301184
C  -5.02008076 4.40583142 0.83912654
C  -5.51328898 2.08856553 0.39435164
C  -6.31373319 4.74939654 0.44347731
H  -4.31880521 5.17367255 1.1723616
C  -6.81225722 2.45308703 0.00063146
C  -7.22440595 3.77629727 0.02551788
H  -6.6241797 5.79598573 0.46557844
H  -8.24042487 4.02152746 -0.28564452
C  -2.08878624 3.1878341 0.66701132
C  -5.11801902 0.72093809 0.26623264
C  2.88273083 -0.98605531 -1.73513837
C  -0.75332174 2.04311413 2.35845216
H  0.2396655 1.81563831 2.75478148
C  6.00742368 -2.77811185 0.57012784
C  5.62017966 -3.69627677 1.55516207
C  7.38873195 -2.56750025 0.3601107
C  6.5647062 -4.37516544 2.32639299
H  4.55274402 -3.86635141 1.71462088
C  8.32038845 -3.25900275 1.14838256
C  7.92792108 -4.15811935 2.13090539
H  6.2360612 -5.08053532 3.09233751
H  8.69258582 -4.67005224 2.71634576
F  -7.63597133 1.50556929 -0.41278043
F  9.61057722 -3.04767563 0.93446642
N  3.45618922 1.22954587 -0.9804804
C  -0.01057937 -0.4747847 0.17040464
C  1.95451025 -0.48320565 1.43032925
C  -0.88608039 0.18063198 -0.73672837
C  -0.31323218 -1.79829405 0.60369933
C  1.72355794 -1.78980592 1.90310711
H  2.85663598 0.06323784 1.72108462
C  -2.01785151 -0.45988271 -1.18374902
H  -0.62881449 1.19155472 -1.06569884
C  -1.48882358 -2.42628706 0.11631005
C  0.58890139 -2.44606345 1.48371866
H  2.44792895 -2.25047477 2.57561892
C  -2.35107639 -1.78391138 -0.75788514
H  -2.67898787 0.05239361 -1.88772272
H  -1.69814013 -3.45715008 0.42085456
H  0.36847263 -3.46458376 1.81334447
H  -2.84248416 -2.62111351 -1.60328234
N  1.12967398 0.14609807 0.60449219
Pd -4.41212985 -2.30464929 -0.30180473
N  -4.80065842 -0.38019416 0.1110331
O  -6.17009145 -2.83428334 0.40253568
C  -6.39463929 -4.12443618 0.50804373
O  -7.36311498 -4.60906915 1.04379553
N  -4.29708869 -4.20877877 -0.7540399
C  -5.31174426 -5.0193642 -0.11141814
H  -4.8993912 -5.64616045 0.69854156
H  -5.81895275 -5.69727921 -0.81607871
C  -3.60114118 -4.5788659 -1.82193593
C  -3.6990619 -5.99653167 -2.32568481
H  -3.63795587 -6.72379662 -1.50452229
H  -4.6669236 -6.14277533 -2.8295547
H  -2.89516247 -6.16986726 -3.04890402
O  -2.86045954 -3.76419935 -2.43403281
C  -2.17582245 3.95741576 -0.62031215
H  -2.08742638 5.04037104 -0.44582146
H  -1.33026155 3.68477976 -1.2731581
H  -3.11265226 3.75373294 -1.15638149
C  5.69258071 0.23329413 0.52534505
H  6.40839194 0.7481418 -0.13367573
H  5.07285176 1.01907624 0.99011738
H  6.24842791 -0.2918373 1.31342223
H  2.06698276 -0.51860935 -2.29414623
H  -1.82328405 0.87833993 3.82882395
C  7.8809565 -1.68729323 -0.66195247
N  8.29856712 -0.98036758 -1.48175236
