program: Gaussian 09
title: 000036575
version: EM64L-G09RevD.01
frameworkgroup: C1[X(C10H14ClNO)]
method: RPBEPBE
basis: SDD
operation: Freq
keyword: #p
keyword: freq=noraman
keyword: PBEPBE/SDD
title: #p freq=noraman PBEPBE/SDD
converged: NO YES NO NO
title: Mulliken charges:
elementType: Cl O N C C C C C C C C C C H H H H H H H H H H H H H H
charge: -0.005423 -0.163709 0.086705 -0.116393 -0.113787 -0.094464 -0.094735 -0.260654 -0.457084 -0.482863 -0.457495 -0.471797 -0.466612 0.260116 0.257480 0.210426 0.211771 0.201860 0.232719 0.238526 0.205308 0.234417 0.202779 0.209741 0.228657 0.202178 0.202334
chargesum: 0.00000
title: Mulliken charges with hydrogens summed into heavy atoms:
elementType: Cl O N C C C C C C C C C C
charge: -0.005423 -0.163709 0.086705 0.143722 0.143692 0.115963 0.117036 -0.260654 -0.022505 -0.039029 -0.020299 -0.033399 -0.062100
polarizability: 1.22966954e+02 2.67497929e+00 1.22827687e+02 1.66817208e+00 -1.18764145e+00 1.02211592e+02
1716.lowfreq: -25.1108 0.0009 0.0013 0.0015 15.0350 24.8875 103.7777 140.3237 155.0209
frequency: 103.7069 140.2830 154.9960 222.5729 246.2097 298.7205 324.5753 329.4687 347.9159 371.8027 412.4036 430.6301 431.4633 469.2815 611.2087 626.3687 643.4694 693.1787 748.2582 767.2097 795.0871 828.0268 841.6073 869.5628 874.6528 902.1649 914.8152 945.1448 965.5915 997.1329 1019.5175 1040.9874 1065.1879 1067.2545 1069.7535 1098.2024 1102.6643 1108.4345 1112.3066 1148.4408 1214.1383 1241.3708 1253.8934 1261.7787 1291.1093 1292.6460 1296.5963 1309.9494 1318.3250 1321.4122 1338.2158 1341.9500 1347.1212 1351.1409 1360.3217 1405.2045 1454.3169 1458.4031 1466.0164 1472.4385 1484.0122 2968.5501 2977.6901 2985.4672 2988.3475 2989.3780 3006.5122 3012.6584 3027.2948 3035.7104 3037.8898 3039.3899 3050.9415 3053.5631 3057.1980
redmass: 9.3823 6.0476 8.6449 4.2918 8.3434 3.2706 2.4474 8.0679 2.7919 2.3804 4.3007 1.9283 1.7406 5.2476 3.9906 5.3636 4.3498 5.2286 4.6588 3.6948 2.6693 2.9372 3.0564 1.6072 1.5778 2.3414 2.0894 2.1569 2.2737 2.0147 6.1553 1.9914 1.6145 1.6291 1.5774 1.6621 1.3266 1.0121 1.0132 1.2438 1.0400 1.5432 1.7436 1.8741 1.9408 2.0123 2.0371 1.7376 1.3275 1.3122 1.4620 1.6344 1.4659 1.4628 1.6930 7.7977 1.0818 1.0856 1.0881 1.0925 1.0884 1.0614 1.0616 1.0652 1.0621 1.0642 1.0814 1.0827 1.1026 1.0868 1.0962 1.0914 1.1013 1.1010 1.1011
irintensity: 0.4556 0.2289 0.3422 2.0915 8.1136 1.3840 0.4975 5.4869 1.1440 2.1248 0.3620 0.4117 0.1073 10.2415 2.7363 8.7523 6.3488 11.1768 39.5630 4.4390 2.2577 1.1341 9.4469 1.4612 1.1670 15.5910 0.5801 8.7076 17.6394 5.8536 2.4961 0.2763 7.7647 5.8713 2.6045 6.8634 1.6414 0.0551 0.0842 0.6049 2.2645 1.2270 5.8702 4.5253 1.5861 0.1959 1.1340 1.5177 0.2061 0.3168 1.1550 2.2724 6.8896 1.7997 6.6335 94.6726 2.9863 4.6748 24.9099 22.5948 5.4811 29.8284 21.9884 2.2937 20.0474 51.9336 108.2554 84.1239 34.0092 24.5299 50.3218 3.1714 10.3271 36.7011 27.2123
temp: 298.150 k
press: 1.00000 atm
elementType: 17 8 7 6 6 6 6 6 6 6 6 6 6 1 1 1 1 1 1 1 1 1 1 1 1 1 1
symmnumber: 1
zpe: 590065.3 jmol-1
zpe.correction: 0.224744 hartree
zpe.thermalcorrener: 0.235397 hartree
zpe.thermalcorrenthalpy: 0.236342 hartree
zpe.thermalcorrgfe: 0.189110 hartree
zpe.sumelectzpe: -978.439950 hartree
zpe.sumelectthermal: -978.429296 hartree
zpe.sumelectthermalent: -978.428352 hartree
zpe.sumelectthermalfe: -978.475583 hartree
dipole: 4.1038 -0.6993 -0.1047
dipole: 4.1642
quadrupole: -91.1157 -86.7358 -82.0734
quadrupole: 3.1788 1.1020 0.0550
quadrupole: -4.4741 -0.0942 4.5683 3.1788 1.1020 0.0550
hfenergy: -978.6646936 hartree
pointgroup: C01 [X(C10H14Cl1N1O1)]
dipole: 1.6299726 0.1525681 -0.0636261 debye
polarizability: 121.6904772|2.2678935|124.1903445|1.6723558|0.2508552|102.1254117 unknown
InChI: InChI=1S/C10H14ClNO/c11-10(12-13)8-2-6-1-7(4-8)5-9(10)3-6/h6-9H,1-5H2
charge 0 multiplicity 1
27 atoms
Cl -1.902003 -2.055862 -0.11056
O  -2.772299 1.202414 -0.227919
N  -2.276391 0.417649 0.633208
C  -0.3531 0.112694 -1.173885
C  0.00015 -0.460742 1.28362
C  1.830669 -0.949867 -0.408601
C  1.308521 1.452251 0.221175
C  -1.003478 -0.352217 0.13023
C  0.785625 -0.875185 -1.55793
C  0.268576 1.527509 -0.927616
C  1.139526 -1.441418 0.893618
C  0.599655 0.964797 1.513745
C  2.437628 0.459045 -0.165879
H  -1.115826 0.174068 -1.970767
H  -0.526847 -0.80329 2.192359
H  2.63224 -1.659888 -0.689528
H  1.737393 2.458001 0.395021
H  1.267914 -0.514186 -2.487203
H  0.367858 -1.876465 -1.768979
H  -0.522324 2.263702 -0.696775
H  0.75586 1.855612 -1.865989
H  0.734778 -2.461348 0.759688
H  1.873109 -1.481474 1.72213
H  1.318612 0.909638 2.353668
H  -0.195587 1.675528 1.812836
H  3.196279 0.412291 0.640469
H  2.953562 0.814243 -1.079935
