program: Gaussian 09
title: 000036597
version: EM64L-G09RevD.01
frameworkgroup: C1[X(C22H16O9)]
method: RPBEPBE
basis: SDD
operation: Freq
keyword: #pfreq=noraman
keyword: PBEPBE/SDD
title: #p freq=noraman PBEPBE/SDD
converged: YES YES NO NO
title: Mulliken charges:
elementType: O O O O O O O O O C C C C C C C C C C C C C C C C C C C C C C H H H H H H H H H H H H H H H H
charge: -0.244367 -0.254833 -0.321435 -0.186899 -0.249722 -0.247326 -0.209702 -0.330273 -0.194889 0.185173 0.018529 0.338075 0.050761 0.058134 0.061539 -0.103973 0.070463 0.237738 0.411584 -0.080249 0.151230 -0.566694 -0.599810 0.357514 0.286066 -0.511013 -0.791534 0.283683 -0.534242 -0.493023 -0.752832 0.282624 0.264883 0.290491 0.257270 0.256636 0.214573 0.387637 0.228492 0.252394 0.227835 0.250583 0.234438 0.244403 0.273963 0.245006 0.251101
chargesum: 0.00000
title: Mulliken charges with hydrogens summed into heavy atoms:
elementType: O O O O O O O O O C C C C C C C C C C C C C C C C C C C C C C
charge: -0.244367 -0.254833 0.066202 -0.186899 -0.249722 -0.247326 -0.209702 -0.330273 -0.194889 0.185173 0.018529 0.338075 0.050761 0.058134 0.061539 -0.103973 0.070463 0.237738 0.411584 -0.080249 0.151230 -0.284070 -0.334928 0.357514 0.286066 -0.220522 -0.063055 0.283683 0.174478 0.236401 0.017238
polarizability: 5.05205466e+02 -9.01028880e+00 3.57280212e+02 -2.84378165e+00 -9.58570364e+00 1.30334081e+02
1716.lowfreq: -3.8886 -2.8862 -0.0007 -0.0007 -0.0005 3.4100 14.5395 21.2023 30.8803
frequency: 14.5349 21.1981 30.8783 40.1970 60.0897 62.4888 69.7210 88.8317 95.4523 99.8074 107.5150 114.3314 135.1521 163.1931 177.8549 188.4548 198.0830 201.4458 207.5982 223.0365 228.2244 246.7316 256.1011 270.7843 284.6915 304.4557 307.5492 323.8957 335.5280 340.8565 358.9496 382.3353 393.6920 411.7233 421.0991 436.4317 450.0531 455.2623 486.1773 505.3263 517.9838 524.6395 537.5180 538.9359 564.1532 572.6726 581.7008 610.7464 620.4554 646.8569 665.2046 688.6694 706.1825 715.1465 722.0179 742.2075 757.6656 777.8370 809.0603 824.5215 846.4730 868.0460 878.1232 881.7630 889.6611 915.5014 950.4576 971.7679 980.8279 987.7814 1012.8678 1034.8443 1037.7174 1045.3448 1047.6132 1092.9305 1101.8473 1113.1158 1116.7543 1137.5015 1143.2381 1155.0310 1168.3813 1184.1541 1204.3699 1224.4755 1253.6561 1287.0562 1298.3583 1304.3859 1332.0265 1364.1791 1377.7063 1388.5302 1400.0502 1401.0765 1411.8946 1420.9175 1425.5016 1435.4130 1438.8424 1448.5711 1449.5577 1451.4115 1453.4445 1454.8433 1467.0995 1467.8394 1473.3287 1475.7976 1504.7452 1540.0763 1548.0568 1554.6664 1581.2175 1588.1300 1629.8506 1633.6090 1702.9306 2363.5868 2968.9289 2995.4817 3011.7759 3012.5724 3061.3308 3083.5192 3095.7717 3105.0833 3128.4247 3135.0844 3140.0047 3145.8917 3162.7167 3182.7538 3186.5056
redmass: 7.0447 4.4578 6.6816 4.5777 4.6010 4.5122 4.1123 2.7997 3.0636 1.6325 4.5329 6.7182 8.3655 4.3750 5.1910 5.0464 1.6972 1.3649 1.3935 1.9761 2.8670 5.4993 2.8426 4.2448 6.7584 5.4110 6.2012 7.7566 6.9186 4.7027 6.2227 7.0229 9.3624 7.4627 6.6280 6.2277 9.4813 9.6667 5.6454 4.7996 3.9777 6.0015 4.6567 6.8045 5.0097 6.7235 8.0318 7.4028 8.4996 4.9968 5.6314 4.4007 5.6679 7.2643 6.2630 6.6034 5.7919 6.7982 7.0590 6.9881 1.7592 8.9722 1.6014 1.5094 8.8523 7.4874 7.6065 3.6243 2.4101 3.7110 4.1341 1.6422 1.0622 1.5896 2.2487 3.4683 1.2475 1.2600 4.5657 1.7134 2.4473 1.6919 2.0966 3.0246 2.6041 2.2211 3.1219 5.6387 6.0103 5.7594 3.2635 7.6797 1.2515 5.5450 1.9785 3.0697 3.3243 2.4407 7.3316 1.2906 1.2611 1.0464 1.0571 1.0719 1.0536 1.0553 1.1581 1.1656 2.5047 1.3223 7.8661 5.9433 9.3785 9.4307 3.3303 9.6763 7.3233 4.3312 10.7985 1.0824 1.0327 1.0366 1.0367 1.0279 1.1044 1.0956 1.1017 1.0960 1.1053 1.1001 1.1066 1.1022 1.0921 1.0924 1.0920
irintensity: 2.0134 2.6083 0.9151 1.0979 0.9611 4.3998 1.0312 1.1732 0.1532 2.6109 2.0272 5.0779 0.4495 3.1164 4.6080 0.7420 0.4012 0.7534 1.4714 0.5174 0.5483 1.4095 0.7745 8.0482 0.3069 4.1656 4.8815 5.4356 1.1383 0.3821 3.9233 5.3719 1.3940 15.4281 0.7401 11.7838 24.7791 1.8204 31.3338 10.7990 4.9846 22.3593 1.8582 1.7353 0.5339 0.8750 2.6421 0.2089 10.1507 9.8706 26.9077 6.8305 10.0859 6.5361 4.3190 5.5900 14.8224 24.9191 11.8060 3.1100 27.7167 8.5718 35.7863 27.1964 28.5774 9.4338 82.9970 78.3987 123.8332 59.8651 53.9392 4.7774 119.6566 14.4805 23.2175 22.5067 0.0346 0.1275 184.7550 132.3480 295.9842 70.3155 225.2987 265.9841 58.2391 18.1205 18.9485 72.3040 218.8702 455.2152 139.9376 49.3315 100.4703 20.1757 72.4905 259.7260 150.8589 54.0864 89.3554 3.2989 28.1327 12.7553 21.8159 65.8925 25.5589 10.4556 69.9192 56.4164 30.9155 21.8909 52.1402 4.1667 248.7553 550.0982 214.4375 69.0421 369.7276 55.8079 149.3015 249.6115 53.7611 22.4137 0.7943 46.2539 39.2182 6.1581 35.4399 4.3709 27.6594 24.3127 33.6357 8.5842 5.2194 1.7917 1.1528
temp: 298.150 k
press: 1.00000 atm
elementType: 8 8 8 8 8 8 8 8 8 6 6 6 6 6 6 6 6 6 6 6 6 6 6 6 6 6 6 6 6 6 6 1 1 1 1 1 1 1 1 1 1 1 1 1 1 1 1
symmnumber: 1
zpe: 875419.4 jmol-1
zpe.correction: 0.333430 hartree
zpe.thermalcorrener: 0.361611 hartree
zpe.thermalcorrenthalpy: 0.362555 hartree
zpe.thermalcorrgfe: 0.273202 hartree
zpe.sumelectzpe: -1522.753381 hartree
zpe.sumelectthermal: -1522.725200 hartree
zpe.sumelectthermalent: -1522.724256 hartree
zpe.sumelectthermalfe: -1522.813609 hartree
dipole: -0.7440 8.3237 -1.5077
dipole: 8.4918
quadrupole: -145.7862 -176.5516 -182.7795
quadrupole: -1.6883 -1.6751 -3.1601
quadrupole: 22.5862 -8.1791 -14.4071 -1.6883 -1.6751 -3.1601
hfenergy: -1523.0868107 hartree
pointgroup: C01 [X(C22H16O9)]
dipole: 0.3695432 -3.2874979 -0.4664357 debye
polarizability: 505.4051841|-4.762082|357.3045737|-8.8312518|0.2166485|130.1100007 unknown
InChI: InChI=1S/C22H16O9/c1-8-5-10(28-3)6-12-14(8)19(26)17-20(27)15-11(24)7-13(29-4)18(25)16(15)21(22(17)31-12)30-9(2)23/h5-7,27H,1-4H3
charge 0 multiplicity 1
47 atoms
O  1.435661 -0.837218 -0.099297
O  -0.842338 -2.111004 -0.209684
O  -0.804467 3.483026 0.123133
O  1.898632 3.318966 -0.042119
O  6.216672 -1.559664 -0.12663
O  -5.965826 -0.364102 0.076636
O  -3.570223 -1.96142 -0.170355
O  -3.275504 3.520166 0.198303
O  -1.580046 -2.558103 1.976039
C  0.41821 1.395618 -0.011171
C  0.32043 -0.013647 -0.059416
C  -2.137261 0.001078 0.006952
C  -2.078959 1.43059 0.068845
C  2.933959 1.133267 -0.057182
C  -0.925168 -0.718857 -0.060288
C  -0.822663 2.130931 0.060856
C  1.76572 2.056622 -0.035678
C  2.727936 -0.272314 -0.088375
C  4.302199 1.596281 -0.050808
C  -3.459697 -0.69961 -0.033654
C  -3.319438 2.213303 0.135532
C  3.759546 -1.227132 -0.113713
C  5.340656 0.649795 -0.074231
C  5.084983 -0.748198 -0.105643
C  -4.693009 0.158665 0.073656
C  -4.596845 1.535055 0.140778
C  4.670961 3.066254 -0.016959
C  -1.298838 -2.978225 0.845533
C  6.01567 -3.013896 -0.156205
C  -6.283281 -1.807267 0.222251
C  -1.340118 -4.389014 0.32852
H  3.497363 -2.286377 -0.138266
H  6.384361 0.977447 -0.068418
H  -5.500086 2.147081 0.206407
H  4.259431 3.605552 -0.887093
H  4.238214 3.571582 0.863272
H  5.768162 3.182516 -0.00121
H  -1.819088 3.801633 0.172197
H  5.471267 -3.358035 0.743632
H  7.027811 -3.442254 -0.16648
H  5.468593 -3.320897 -1.067827
H  -5.983344 -2.365761 -0.676757
H  -7.376414 -1.811412 0.348477
H  -5.782957 -2.234982 1.105587
H  -2.226821 -4.486401 -0.323138
H  -1.421856 -5.095805 1.166693
H  -0.449089 -4.609529 -0.280806
