program: Gaussian 09
title: 000036532
version: EM64L-G09RevD.01
frameworkgroup: C1[X(C17H26N2O2)]
method: RPBEPBE
basis: SDD
operation: Freq
keyword: #p
keyword: freq=noraman
keyword: PBEPBE/SDD
title: #p freq=noraman PBEPBE/SDD
converged: YES YES NO NO
title: Mulliken charges:
elementType: O O N N C C C C C C C C C C C C C C C C C H H H H H H H H H H H H H H H H H H H H H H H H H H
charge: -0.321929 -0.263409 -0.085701 -0.482765 0.053461 -0.372952 -0.377365 -0.456791 -0.439279 0.048923 -0.737465 -0.736312 0.243860 0.137054 0.337747 0.363083 -0.420509 -0.411406 -0.832996 -0.828868 -0.233291 0.229559 0.223612 0.171690 0.176686 0.222849 0.205340 0.216769 0.209985 0.229216 0.172823 0.225497 0.220288 0.211333 0.225230 0.221635 0.210562 0.325666 0.232085 0.232068 0.224484 0.245275 0.234878 0.217279 0.284074 0.222983 0.225047
chargesum: 0.00000
title: Mulliken charges with hydrogens summed into heavy atoms:
elementType: O O N N C C C C C C C C C C C C C C C C C
charge: -0.321929 -0.263409 -0.085701 -0.157100 0.283021 0.022349 0.022169 -0.034682 -0.000078 0.221746 -0.080347 -0.078886 0.243860 0.137054 0.337747 0.363083 -0.188423 -0.179338 -0.128359 -0.104532 -0.008245
polarizability: 2.83682477e+02 -4.84369682e+00 1.89487757e+02 1.35635316e+01 7.64828280e+00 1.50807155e+02
1716.lowfreq: -4.9796 -0.0005 -0.0004 0.0007 4.9522 10.3184 20.8470 28.4992 33.8877
frequency: 20.3713 27.8145 33.7382 49.7076 63.0564 75.6022 94.3987 119.0467 148.1023 161.2251 169.6842 173.5336 192.6778 210.9751 216.2884 227.3040 237.7438 254.5739 288.4783 310.0104 313.4289 338.3491 338.4825 382.8365 422.8314 437.4013 454.2208 465.6397 475.0003 478.6239 514.1275 516.3285 530.6463 543.5870 585.4883 595.3324 673.3343 698.3356 708.7215 719.6281 753.4727 778.8069 815.4057 827.8824 855.8157 869.4349 899.4656 905.4095 916.4343 936.7731 939.8094 958.2108 965.2108 975.0699 986.1326 988.0201 995.4121 1025.5068 1039.3604 1045.2488 1054.2806 1064.2933 1098.2610 1115.6900 1121.6035 1134.2308 1137.4524 1144.8203 1158.6210 1172.4602 1177.4096 1200.8054 1230.6635 1246.1151 1257.4355 1261.3358 1274.4355 1280.4189 1304.1469 1311.0631 1322.2784 1327.3039 1339.6771 1359.1227 1360.6435 1370.2436 1377.2611 1388.2747 1393.0365 1398.6352 1400.9304 1435.0445 1452.4967 1454.0480 1457.0303 1459.6523 1466.3638 1470.1431 1470.6027 1471.9491 1478.1810 1480.6509 1484.3858 1488.5327 1494.5102 1501.7989 1604.2692 1605.3197 1666.2811 2813.0152 2818.8722 2834.2436 2963.3815 2980.3135 2984.1291 2988.1355 3003.4263 3004.8945 3011.3755 3041.0542 3062.6179 3067.1891 3069.6337 3072.4561 3075.6547 3079.6581 3087.0567 3087.1611 3087.8752 3089.7208 3091.3030 3121.3856 3131.4087 3156.6694 3532.7932
redmass: 4.5477 3.0505 3.7840 2.6664 4.4718 4.4307 5.3844 3.7049 1.7993 2.7424 2.3164 1.1121 1.2531 1.8893 1.5168 2.3242 2.1615 2.3052 3.6852 3.3448 3.2852 2.0306 4.0363 2.9606 2.8913 2.3469 2.5567 2.6653 2.9339 2.9961 4.0033 3.0960 3.6089 3.2517 2.6916 1.4774 6.2511 6.7556 5.0604 2.7867 5.1816 1.2200 1.4705 3.3033 2.9712 2.7731 1.3093 3.7646 1.1636 2.4509 1.7606 1.5575 2.2780 1.3483 1.7200 1.6874 4.1157 2.5854 1.6682 1.6900 1.5737 2.0039 1.7121 3.1664 2.1327 2.1758 1.3438 2.0941 3.2036 1.9837 1.1914 1.8668 3.3019 1.4400 1.3405 1.6531 1.2868 2.5201 1.2164 1.3164 1.4181 1.3398 1.3669 1.6176 1.4670 5.0173 1.2580 1.3603 1.2334 1.2682 1.2389 1.9873 1.0918 1.8261 1.0619 1.1253 1.0937 1.1044 1.0686 1.0874 1.4960 1.0476 1.0771 1.2897 1.5403 1.0513 6.5365 5.9595 8.6659 1.0782 1.0740 1.0716 1.0415 1.0364 1.0355 1.0362 1.0641 1.0640 1.0758 1.0927 1.0970 1.0928 1.0990 1.0902 1.1023 1.0985 1.0978 1.0998 1.0980 1.0981 1.0980 1.0856 1.0920 1.0995 1.0754
irintensity: 0.4526 0.1698 0.2922 0.4042 0.5033 0.3179 4.5879 0.8713 0.2906 0.2897 4.4073 0.8927 0.1576 1.4530 1.9450 1.0077 6.4539 7.0462 4.7763 4.0123 0.5513 2.5035 6.1965 7.0366 0.3189 3.3043 2.4506 0.8929 4.5290 5.7714 0.2735 0.9346 0.2065 12.6290 14.6750 70.1797 2.3039 15.3943 25.2089 5.8154 7.9592 56.7562 0.5498 1.0541 4.3990 4.7813 0.2716 12.5727 3.0298 7.9478 4.3147 2.0096 4.3195 1.7338 111.1050 0.6699 195.0802 189.0538 5.2691 6.5633 11.8975 5.7659 2.3088 4.8807 6.1779 15.5094 6.4640 25.1250 480.1080 20.1653 10.3718 6.7072 29.0376 17.3659 8.5421 8.4471 10.0259 10.3987 15.0235 11.8771 18.7974 32.8475 1.1974 36.3142 13.4259 17.8868 14.3035 24.9646 10.4588 18.2480 16.3760 47.9333 7.1226 46.9361 5.1786 32.4994 14.4511 17.1012 0.4193 11.9962 219.0161 3.8431 4.8920 31.7571 197.1184 17.3076 8.7148 5.9133 204.7095 26.9684 60.5002 201.4992 33.2192 23.2842 28.3618 23.0416 8.4011 19.0534 29.0071 19.6264 10.6403 36.7552 1.0599 17.5763 60.4334 11.4217 47.5294 22.9755 71.7594 20.9967 32.9497 0.1362 26.1628 35.1644 27.1294
temp: 298.150 k
press: 1.00000 atm
elementType: 8 8 7 7 6 6 6 6 6 6 6 6 6 6 6 6 6 6 6 6 6 1 1 1 1 1 1 1 1 1 1 1 1 1 1 1 1 1 1 1 1 1 1 1 1 1 1
symmnumber: 1
zpe: 1057039.4 jmol-1
zpe.correction: 0.402605 hartree
zpe.thermalcorrener: 0.424669 hartree
zpe.thermalcorrenthalpy: 0.425614 hartree
zpe.thermalcorrgfe: 0.350346 hartree
zpe.sumelectzpe: -921.757165 hartree
zpe.sumelectthermal: -921.735101 hartree
zpe.sumelectthermalent: -921.734157 hartree
zpe.sumelectthermalfe: -921.809424 hartree
dipole: 1.0793 0.5815 1.4382
dipole: 1.8898
quadrupole: -113.1206 -121.2587 -130.1824
quadrupole: -5.9568 -3.9179 -0.3062
quadrupole: 8.3999 0.2619 -8.6618 -5.9568 -3.9179 -0.3062
hfenergy: -922.1597704 hartree
pointgroup: C01 [X(C17H26N2O2)]
dipole: -0.4328967 -0.0597863 0.6015362 debye
polarizability: 283.5789986|-10.1066635|183.0942733|-10.6230039|-16.4450238|157.304118 unknown
InChI: InChI=1S/C17H26N2O2/c1-12(2)19-10-8-15(9-11-19)21-17(20)18-16-13(3)6-5-7-14(16)4/h5-7,12,15,18H,8-11H2,1-4H3
charge 0 multiplicity 1
47 atoms
O  -0.260321 0.302057 0.824298
O  0.865772 0.403728 -1.251791
N  -4.451016 -0.143097 0.050291
N  1.982277 0.008029 0.800911
C  -1.567544 0.481105 0.121607
C  -3.954237 1.177924 0.525669
C  -3.515207 -0.695286 -0.969582
C  -2.543041 1.067573 1.143641
C  -2.088638 -0.863592 -0.403488
C  -5.87058 -0.083086 -0.442084
C  -6.818697 0.460974 0.653263
C  -6.365236 -1.480005 -0.887399
C  0.88111 0.250528 -0.005229
C  3.337664 -0.15483 0.35288
C  4.021837 -1.346081 0.741496
C  3.986858 0.863916 -0.403895
C  5.367994 -1.515581 0.343716
C  5.330544 0.641939 -0.798283
C  3.315284 -2.415916 1.556079
C  3.295119 2.162845 -0.762545
C  6.01979 -0.532877 -0.432918
H  -1.402428 1.177382 -0.723716
H  -4.63828 1.565946 1.296701
H  -3.936037 1.927435 -0.311553
H  -3.478871 -0.038598 -1.880109
H  -3.875754 -1.683892 -1.294212
H  -2.200527 2.065013 1.475663
H  -2.5841 0.405115 2.027743
H  -2.112351 -1.589599 0.430477
H  -1.419851 -1.25121 -1.192938
H  -5.93427 0.605371 -1.328316
H  -6.684368 -0.114152 1.58785
H  -6.656911 1.530259 0.87235
H  -7.86755 0.351726 0.324305
H  -6.195599 -2.215136 -0.079348
H  -5.865924 -1.841949 -1.802202
H  -7.448165 -1.440143 -1.101702
H  1.761671 -0.214896 1.774136
H  5.899787 -2.42919 0.634116
H  5.840837 1.414661 -1.385072
H  3.096174 -2.080084 2.590205
H  2.350972 -2.701939 1.09663
H  3.939297 -3.321603 1.636169
H  4.030117 2.924566 -1.073578
H  2.57193 2.008749 -1.583699
H  2.720962 2.561687 0.094492
H  7.060108 -0.678983 -0.74383
