program: Gaussian 09
title: 000036535
version: EM64L-G09RevD.01
frameworkgroup: C1[X(C16H22N2O3)]
method: RPBEPBE
basis: SDD
operation: Freq
keyword: #p
keyword: freq=noraman
keyword: PBEPBE/SDD
title: #p freq=noraman PBEPBE/SDD
converged: YES YES NO NO
title: Mulliken charges:
elementType: O O O N N C C C C C C C C C C C C C C C C H H H H H H H H H H H H H H H H H H H H H H
charge: -0.327593 -0.260764 -0.233591 -0.075308 -0.462129 0.032267 -0.456955 -0.429697 -0.404643 -0.346978 -0.296243 -0.700838 0.248821 0.487836 -0.367348 -0.456943 0.321304 -0.341300 -0.339703 0.112609 -0.789674 0.252193 0.205981 0.228156 0.181304 0.253140 0.214119 0.202277 0.213788 0.168844 0.176326 0.212099 0.230718 0.212490 0.214819 0.333688 0.301888 0.228371 0.242690 0.278867 0.237737 0.237650 0.259725
chargesum: 0.00000
title: Mulliken charges with hydrogens summed into heavy atoms:
elementType: O O O N N C C C C C C C C C C C C C C C C
charge: -0.327593 -0.260764 -0.233591 -0.075308 -0.128442 0.284461 -0.022818 0.004747 0.011753 0.035654 0.092181 -0.042812 0.248821 0.487836 -0.065460 -0.228572 0.321304 -0.098610 -0.060836 0.112609 -0.054562
polarizability: 3.32229815e+02 -1.12833057e+01 1.78065136e+02 9.17720569e+00 1.92422986e+01 1.33661654e+02
1716.lowfreq: -11.5793 -7.7146 -1.2015 -0.0009 0.0004 0.0009 14.7402 20.0083 39.6724
frequency: 14.1384 19.8849 39.6230 57.4986 62.8783 67.4238 82.7173 111.0109 124.1891 137.0234 146.6618 175.7873 182.5556 213.8594 232.5476 235.1760 286.2440 293.9062 319.4627 320.6229 360.7903 378.7625 396.4096 411.1746 441.2088 446.7392 485.7096 488.5989 499.5202 547.4183 589.5596 593.2111 626.9360 650.7982 689.6609 705.1405 727.2926 742.5638 752.2695 802.2806 821.9449 844.4866 858.7208 860.0355 870.9377 896.8780 924.2277 947.2342 949.9244 959.2780 982.9052 992.4420 993.5394 1001.5351 1008.2435 1026.5441 1049.2973 1074.0716 1080.9893 1091.8344 1125.9768 1128.2363 1130.4204 1147.6373 1156.1933 1162.0497 1190.2681 1199.5078 1229.5130 1263.0050 1265.6700 1272.3047 1282.3349 1284.1032 1297.9178 1313.8585 1318.9328 1340.4151 1344.9812 1355.4722 1361.0906 1368.1551 1376.7923 1387.9341 1396.0557 1426.0685 1447.6347 1459.4295 1462.8175 1463.1819 1468.3286 1471.0465 1474.7934 1481.2925 1484.8066 1492.3404 1520.6295 1573.3968 1595.4842 1624.1606 1659.9130 2821.6858 2836.3121 2851.3898 2985.1716 2987.5547 2988.5477 2996.6247 3016.9458 3039.6287 3050.0087 3055.6816 3056.2058 3069.3081 3069.6574 3080.9723 3092.7700 3118.8818 3124.9480 3148.1707 3159.9477 3190.6473 3537.4214
redmass: 4.3547 4.6413 3.6356 4.1863 5.0260 3.6030 4.7261 3.3429 2.1864 4.7724 1.0471 5.4774 3.7968 3.1273 3.7731 1.3436 2.0671 4.8142 4.0881 4.7046 2.7932 4.7814 3.3544 2.9495 3.3088 2.8277 3.3751 2.5826 3.0229 3.1187 3.7668 2.3325 7.0791 1.4023 5.9663 4.3566 6.4885 3.5333 2.4273 1.1482 3.8598 1.3364 1.4863 2.9065 1.4876 2.7166 3.2157 2.2065 2.0918 1.7957 1.3268 2.4496 1.3572 3.1578 3.7643 1.8187 2.0579 2.3994 2.1078 2.1657 1.4185 1.8650 1.9142 1.3816 2.9346 2.7186 1.1431 2.2038 1.4900 1.3287 1.6455 1.2957 3.1882 1.2788 1.2899 1.4653 1.2993 1.4280 1.3991 1.4644 1.4925 1.4194 3.0809 1.2486 1.4211 4.3724 1.1043 1.0868 1.0766 1.0496 1.0882 1.0505 1.0832 1.0763 2.1197 1.0736 3.0241 4.7739 6.9070 6.2323 8.3319 1.0715 1.0705 1.0698 1.0375 1.0360 1.0612 1.0618 1.0878 1.0857 1.0914 1.0911 1.0957 1.1008 1.0970 1.0982 1.1005 1.0898 1.0991 1.0898 1.0948 1.0948 1.0761
irintensity: 0.0655 0.2183 0.2437 1.5407 6.9671 3.6628 0.0664 2.4201 1.9611 0.4064 0.5271 0.4521 10.4322 0.2503 4.0060 1.6718 2.3138 0.7590 3.7601 4.3686 2.4845 14.3947 5.8311 0.0075 0.8682 5.9618 1.8676 1.0833 15.9824 10.5461 16.5119 17.7462 0.2834 31.9245 1.9758 48.1859 10.8045 1.7261 3.8517 4.0372 13.4052 25.9275 74.0354 1.4460 6.8674 3.8029 3.3606 60.6702 10.0586 3.7739 0.1226 67.7936 2.5594 113.8596 297.0886 1.4609 13.7679 9.8976 6.0062 51.6726 81.9551 21.8041 29.9582 56.2514 458.3069 216.3578 64.1788 31.8696 5.1149 25.9450 4.1664 4.4068 227.9517 37.8319 5.0022 81.5911 6.6623 4.4352 2.7021 13.2410 9.8235 92.4234 89.0020 11.4380 24.5842 23.6324 56.7782 14.5163 8.2298 20.3187 3.9247 11.0837 13.0859 3.3669 396.0321 12.4831 476.8896 23.3167 282.9563 130.7209 172.0829 69.4744 36.5614 199.1867 3.6362 34.2045 19.9566 36.3273 16.6837 11.9350 36.3446 31.0981 23.1725 55.8514 14.0437 51.1155 37.0798 15.6466 19.8762 9.5209 4.4853 3.2034 34.9912
temp: 298.150 k
press: 1.00000 atm
elementType: 8 8 8 7 7 6 6 6 6 6 6 6 6 6 6 6 6 6 6 6 6 1 1 1 1 1 1 1 1 1 1 1 1 1 1 1 1 1 1 1 1 1 1
symmnumber: 1
zpe: 937734.4 jmol-1
zpe.correction: 0.357164 hartree
zpe.thermalcorrener: 0.378213 hartree
zpe.thermalcorrenthalpy: 0.379157 hartree
zpe.thermalcorrgfe: 0.304592 hartree
zpe.sumelectzpe: -956.505461 hartree
zpe.sumelectthermal: -956.484413 hartree
zpe.sumelectthermalent: -956.483468 hartree
zpe.sumelectthermalfe: -956.558034 hartree
dipole: 5.0216 -0.5839 -0.4886
dipole: 5.0790
quadrupole: -144.6724 -116.6624 -126.3885
quadrupole: -12.3100 -11.3346 1.3453
quadrupole: -15.4313 12.5787 2.8526 -12.3100 -11.3346 1.3453
hfenergy: -956.8626257 hartree
pointgroup: C01 [X(C16H22N2O3)]
dipole: -1.9734439 0.077277 -0.3039987 debye
polarizability: 333.2608351|-3.6158024|166.2254734|1.1887788|-27.554923|144.4702974 unknown
InChI: InChI=1S/C16H22N2O3/c1-3-18-10-4-5-15(11-18)21-16(20)17-14-8-6-13(7-9-14)12(2)19/h6-9,15,17H,3-5,10-11H2,1-2H3
charge 0 multiplicity 1
43 atoms
O  -1.558465 1.017997 -0.41862
O  -0.470895 -0.511279 1.014837
O  7.13032 0.38347 -0.47797
N  -4.729765 -1.024346 -0.151616
N  0.690227 0.908749 -0.492852
C  -2.8916 0.603272 0.122467
C  -3.841238 1.780449 -0.116829
C  -3.367818 -0.664061 -0.613862
C  -5.27942 1.365101 0.273762
C  -5.695737 0.064062 -0.443801
C  -5.149092 -2.353899 -0.668382
C  -6.403306 -2.913397 0.027886
C  -0.435891 0.375088 0.126556
C  2.046283 0.574186 -0.269823
C  2.457461 -0.410732 0.669085
C  3.026869 1.270937 -1.033887
C  4.817225 0.005301 0.072616
C  3.829216 -0.681759 0.827578
C  4.388084 0.988693 -0.862387
C  6.284834 -0.257861 0.217256
C  6.749078 -1.313745 1.217317
H  -2.777152 0.376863 1.197929
H  -3.806211 2.051476 -1.19066
H  -3.510667 2.662446 0.460683
H  -3.330715 -0.467324 -1.717858
H  -2.681705 -1.499051 -0.387573
H  -5.339621 1.201573 1.366507
H  -5.987134 2.175249 0.016386
H  -6.69637 -0.244227 -0.095833
H  -5.766767 0.254251 -1.548993
H  -5.316623 -2.325543 -1.77704
H  -4.306127 -3.048754 -0.49196
H  -6.263548 -2.909552 1.123123
H  -7.311968 -2.331515 -0.20855
H  -6.584031 -3.953607 -0.29941
H  0.490605 1.632017 -1.187934
H  1.705233 -0.942012 1.255124
H  2.711948 2.032261 -1.75876
H  4.126857 -1.443904 1.555671
H  5.153099 1.516249 -1.441525
H  6.33058 -2.307179 0.969801
H  6.421374 -1.062507 2.243323
H  7.847773 -1.370039 1.193816
