program: Gaussian 09
title: 000036474
version: EM64L-G09RevD.01
frameworkgroup: C1[X(C12H4Cl4O2)]
method: RPBEPBE
basis: SDD
operation: Freq
keyword: #p
keyword: freq=noraman
keyword: PBEPBE/SDD
title: #p freq=noraman PBEPBE/SDD
converged: NO NO NO NO
title: Mulliken charges:
elementType: Cl Cl Cl Cl O O C C C C C C C C C C C C H H H H
charge: 0.006796 0.006805 -0.023534 -0.023576 -0.257164 -0.257160 0.376899 0.376928 0.328908 0.328935 -0.304115 -0.304130 -0.369888 -0.369867 -0.236795 -0.236820 -0.098795 -0.098724 0.293483 0.293476 0.284168 0.284172
chargesum: 0.00000
title: Mulliken charges with hydrogens summed into heavy atoms:
elementType: Cl Cl Cl Cl O O C C C C C C C C C C C C
charge: 0.006796 0.006805 -0.023534 -0.023576 -0.257164 -0.257160 0.376899 0.376928 0.328908 0.328935 -0.304115 -0.304130 -0.076405 -0.076392 0.047373 0.047353 -0.098795 -0.098724
polarizability: 2.88655506e+02 -1.58296326e+01 2.03968482e+02 8.54171087e-04 -4.98044441e-03 6.09825221e+01
1716.lowfreq: -5.1231 -0.0012 -0.0002 0.0021 3.1139 10.2314 23.6163 47.5326 96.1407
frequency: 23.6163 47.5326 96.1407 119.9425 143.0642 144.4940 149.0658 180.1102 187.4499 209.2988 237.4477 279.8956 330.5977 334.5166 350.4808 376.5252 384.4705 434.5682 464.8517 512.0117 516.8027 528.9622 545.1668 552.2066 555.7623 652.9749 659.7242 670.7245 682.5186 775.9754 807.6506 813.6188 848.0849 848.1677 863.4834 864.0848 916.4086 922.7327 1068.1067 1070.2143 1134.7184 1135.6299 1200.4489 1206.8601 1218.0991 1273.4460 1356.3450 1363.9996 1398.1773 1402.5152 1445.3952 1449.5684 1562.2498 1574.3057 1589.7130 1622.8734 3176.7303 3176.7932 3178.2017 3178.2675
redmass: 21.0675 16.0439 22.5984 10.8607 33.7068 10.9523 10.5037 20.3837 19.1843 5.0755 5.6396 18.1177 8.8986 9.0643 11.7167 20.8254 10.5014 7.4369 8.8943 5.0893 5.1594 6.5683 5.4199 5.0606 11.9249 11.1160 5.1887 7.8644 5.6043 9.5116 9.7491 7.2429 1.3838 1.3839 1.3790 1.3726 9.5506 11.4501 2.1501 2.2320 4.3237 3.6846 1.7136 1.4056 3.1530 3.8704 11.1364 6.0069 4.6549 5.3655 4.6174 3.7952 9.0305 8.5324 9.2723 9.4116 1.0929 1.0929 1.0938 1.0938
irintensity: 0.1161 0.0324 0.0494 0.0000 0.0000 0.8425 0.0000 0.7349 0.0000 0.6266 0.0000 0.0000 0.0033 0.0000 4.0001 4.1138 0.0000 13.0090 0.0000 1.8463 0.0000 0.0000 10.3076 0.0000 0.0000 0.0000 17.5936 7.3637 0.0000 142.4658 0.0000 9.3336 62.9388 0.1206 0.0067 42.4357 0.0008 305.2059 2.2571 0.0000 121.0850 0.0004 0.0000 1.8678 0.0000 208.7154 92.9077 0.0004 0.0011 186.6337 0.0015 751.9285 170.9577 0.0002 0.0000 106.4427 5.4290 0.0277 0.0009 4.6571
temp: 298.150 k
press: 1.00000 atm
elementType: 17 17 17 17 8 8 6 6 6 6 6 6 6 6 6 6 6 6 1 1 1 1
symmnumber: 1
zpe: 327859.3 jmol-1
zpe.correction: 0.124875 hartree
zpe.thermalcorrener: 0.140327 hartree
zpe.thermalcorrenthalpy: 0.141271 hartree
zpe.thermalcorrgfe: 0.080227 hartree
zpe.sumelectzpe: -2449.092744 hartree
zpe.sumelectthermal: -2449.077292 hartree
zpe.sumelectthermalent: -2449.076347 hartree
zpe.sumelectthermalfe: -2449.137392 hartree
dipole: 0.0004 -0.0003 -0.0003
dipole: 0.0006
quadrupole: -130.2880 -131.9270 -131.9293
quadrupole: 2.4332 -0.0002 -0.0002
quadrupole: 1.0935 -0.5456 -0.5479 2.4332 -0.0002 -0.0002
hfenergy: -2449.2176186 hartree
pointgroup: C01 [X(C12H4Cl4O2)]
dipole: -0.0001628 -0.00011 0.0001017 debye
dipolederiv: -0.074223 0.0110267 0.0000066 0.0770281 -0.6769355 -0.0000694 0.0000352 -0.0001767 -0.017255 -0.0742152 0.0110034 -0.0000051 0.077007 -0.6769442 0.0000006 -0.0000132 0.0000427 -0.0172492 -0.7269889 -0.2933678 0.0000618 -0.3454554 -0.2802671 0.0000262 0.0000842 0.0000461 -0.0442978 -0.7270017 -0.2933523 -0.000074 -0.3454342 -0.280277 -0.0000397 -0.0001134 -0.0000552 -0.0443322 -2.1000768 0.0753944 -0.0000098 0.0447776 -0.3140337 0.0000211 -0.0000227 0.0000311 -0.1302157 -2.1001467 0.0753896 -0.0000048 0.0447504 -0.3140332 -0.0000326 0.0000135 -0.0000518 -0.1302148 1.1329073 0.1039469 -0.0000107 1.0117332 -0.2781587 -0.0000559 0.0000401 -0.0000816 0.0869703 1.1329624 0.1039736 0.0000579 1.0117574 -0.2781657 0.0000253 0.0001062 0.0000312 0.0869742 1.355055 -0.1466383 0.000039 -0.8857765 0.3310932 -0.0000054 0.0000423 -0.000004 0.0957597 1.3550781 -0.146634 -0.0000603 -0.8857511 0.3310874 0.0000002 -0.000155 0.0000284 0.0957594 0.1110005 -0.0120155 -0.000028 -0.1714039 1.1041433 0.0001581 -0.0001426 0.0002732 -0.0789908 0.1109936 -0.0119975 0.0000259 -0.1713726 1.1041459 -0.0000134 0.0000472 -0.0000555 -0.0789919 -0.6054782 -0.0506741 -0.0000239 -0.1271803 -0.1041079 -0.0000159 -0.0000483 -0.0000059 -0.1266589 -0.6054842 -0.0506792 0.0000282 -0.1271795 -0.1040796 0.0000301 0.0000439 0.0000119 -0.1266534 -0.3661813 -0.1203212 -0.0000026 -0.1533457 -0.3994922 -0.0000163 0.0000578 -0.0000207 -0.0782122 -0.3662087 -0.1203279 -0.0000144 -0.1533298 -0.3994779 -0.0000249 -0.0000367 -0.000019 -0.0782186 1.1115921 0.3815154 -0.0001403 0.5060623 0.48736 -0.0000593 -0.0001574 -0.0000487 -0.0686903 1.1115913 0.3815039 0.000144 0.5060339 0.4873508 0.0000819 0.0001916 0.0000806 -0.0686686 0.1151693 0.0171244 -0.0000079 0.0132786 0.0443995 -0.0000067 -0.0000059 -0.0000124 0.18594 0.115162 0.0171294 0.0000101 0.0132774 0.0443758 -0.0000026 0.000015 -0.0000036 0.1859359 0.0472377 0.0340021 0.0000252 0.0302647 0.0860055 -0.0000045 0.0000458 -0.0000196 0.1756534 0.0472553 0.0339979 -0.000017 0.0302581 0.0860114 0.0000029 -0.0000274 0.0000095 0.1756567 unknown
polarizability: 288.2873296|16.781582|204.3366585|0.0007979|0.0049898|60.9825221 unknown
InChI: InChI=1S/C12H4Cl4O2/c13-5-1-7(15)11-9(3-5)18-12-8(16)2-6(14)4-10(12)17-11/h1-4H
charge 0 multiplicity 1
22 atoms
Cl -2.399125 3.224718 0.000214
Cl 2.399046 -3.224697 -0.000022
Cl -5.197096 -1.572084 0.000309
Cl 5.197142 1.572063 0.000382
O  0.018732 1.455088 -0.000199
O  -0.018717 -1.455031 -0.000327
C  -1.191533 0.72146 -0.000157
C  1.191529 -0.721429 -0.000177
C  1.21406 0.698147 -0.000128
C  -1.214052 -0.69812 -0.000184
C  -2.412284 1.423058 -0.000129
C  2.412258 -1.423055 -0.000095
C  2.422029 1.408858 0.000005
C  -2.42201 -1.408832 -0.000106
C  -3.643825 0.732587 0.00006
C  3.643817 -0.732605 0.000065
C  -3.627817 -0.676577 0.000071
C  3.627789 0.676547 0.000114
H  2.403645 2.502023 0.000061
H  -2.403582 -2.501999 -0.000129
H  -4.585051 1.288976 0.000271
H  4.585044 -1.288997 0.0002
