program: Gaussian 09
title: 000036507
version: EM64L-G09RevD.01
frameworkgroup: C1[X(C14H20N2O2)]
method: RPBEPBE
basis: SDD
operation: Freq
keyword: #p
keyword: freq=noraman
keyword: PBEPBE/SDD
title: #p freq=noraman PBEPBE/SDD
converged: YES YES NO NO
title: Mulliken charges:
elementType: O O N N C C C C C C C C C C C C C C H H H H H H H H H H H H H H H H H H H H
charge: -0.324964 -0.273494 -0.065491 -0.471108 -0.007737 -0.455812 -0.419308 -0.384874 -0.318842 -0.697781 0.246537 0.311463 0.274018 -0.350727 -0.383697 -0.844187 -0.233034 -0.251255 0.253610 0.236242 0.232874 0.246936 0.179650 0.180187 0.230516 0.172835 0.216458 0.228343 0.223228 0.212497 0.353025 0.298390 0.227244 0.232015 0.243152 0.230506 0.226396 0.226189
chargesum: 0.00000
title: Mulliken charges with hydrogens summed into heavy atoms:
elementType: O O N N C C C C C C C C C C C C C C
charge: -0.324964 -0.273494 -0.065491 -0.118083 0.245873 0.013305 0.007277 0.025829 0.070451 -0.033713 0.246537 0.311463 0.274018 -0.052337 -0.156453 -0.138514 -0.006637 -0.025066
polarizability: 2.50248258e+02 -1.53288848e+00 1.70230205e+02 3.06566808e+00 5.13551326e+00 1.08397632e+02
1716.lowfreq: -6.7638 -4.2269 -0.0007 -0.0004 0.0002 3.9971 12.1700 30.4958 34.6516
frequency: 11.6320 29.6187 34.6061 57.6293 77.0569 94.3562 106.6374 148.2267 178.4858 184.4387 195.0966 208.4918 232.4871 252.2527 286.2218 294.1324 319.0663 383.0569 402.1789 417.2492 442.0545 443.3847 526.0223 539.4992 567.4527 583.0821 645.1930 646.3497 698.7680 715.6743 727.0784 760.4956 765.7114 799.3119 807.4977 814.7854 857.9932 867.9861 878.5242 924.0591 950.5348 956.7879 966.9227 980.4656 990.1829 991.8531 1009.5405 1042.1163 1048.3729 1067.5695 1075.2283 1101.6181 1107.1162 1114.0418 1155.5598 1159.1073 1171.3700 1174.0270 1189.0757 1197.8966 1200.6841 1233.8782 1260.5558 1271.1472 1283.1772 1285.2581 1301.5180 1315.8365 1330.1300 1357.8266 1376.1412 1379.1343 1387.8833 1397.7654 1442.2005 1454.5001 1457.5828 1466.2322 1467.8974 1472.1579 1481.1591 1485.1494 1490.1360 1492.3333 1523.9481 1598.6807 1619.4011 1662.1124 2818.7223 2832.1667 2848.5417 2956.0848 2986.7453 3013.6313 3024.9374 3029.0878 3044.7053 3057.8744 3062.6759 3081.8222 3087.9961 3091.4529 3104.1575 3121.8949 3137.0965 3160.6140 3187.2623 3552.2396
redmass: 4.0216 3.3835 3.8520 8.1250 3.0340 4.5074 2.8858 2.1508 3.1780 2.3070 1.0891 3.8693 2.7699 1.4965 3.6612 4.8758 2.3407 2.8374 3.6407 3.2421 3.1955 2.9755 4.5635 3.1497 3.0282 5.0344 3.1552 1.4821 5.5711 4.6449 2.9035 4.3745 1.3280 1.4238 2.2055 3.3336 2.3995 2.9681 1.3039 2.6552 1.3678 2.0937 2.1666 1.5779 2.5169 1.3048 3.1692 1.5227 2.1082 1.9542 2.3421 2.1408 1.9082 1.8991 2.0798 1.7712 2.1940 1.0985 1.5991 1.9035 1.5829 2.0077 1.2480 2.0850 1.2682 1.3371 1.5873 1.3544 1.2868 1.4593 1.4139 5.0021 1.2616 1.2942 2.1816 1.1768 1.6697 1.0769 1.0648 1.0645 1.0446 1.0735 1.3904 1.0824 2.1355 5.5650 5.8873 8.2517 1.0716 1.0717 1.0707 1.0398 1.0353 1.0872 1.0978 1.0658 1.0836 1.0880 1.0885 1.0989 1.0950 1.1004 1.1038 1.0871 1.0900 1.0981 1.0952 1.0753
irintensity: 0.2133 0.8763 0.7617 3.0612 0.2590 1.0380 2.2224 1.6099 0.2528 0.7959 1.1483 7.5885 3.2101 0.8605 4.8769 7.0706 3.9490 7.1628 1.0753 0.6872 4.6397 8.0634 3.1141 5.5530 1.5961 2.1317 2.9487 37.5205 40.0028 9.6589 0.2326 2.1336 97.9227 7.5983 9.3613 7.6160 7.3582 3.3927 2.9347 9.8302 3.4917 15.3301 10.3341 15.6610 88.9506 1.6805 203.1526 6.9944 12.4514 6.8350 22.4501 97.8658 7.9374 19.6940 341.7498 61.2482 93.9202 0.2920 5.1617 1.7796 59.2073 18.4410 10.1481 8.2361 5.1799 6.1222 41.7393 10.4719 30.4293 13.3568 5.9906 47.1135 23.0594 20.9173 26.7197 26.4671 168.0764 9.5967 10.5829 4.1110 14.1508 0.4991 41.7933 13.4625 455.5494 106.2570 17.0259 222.3988 68.1696 79.4472 210.7129 31.2518 27.6165 24.1931 21.7893 15.9664 50.4301 5.8521 16.4824 63.7567 18.4040 35.4073 25.3285 8.6744 19.5057 28.6351 7.8700 34.3807
temp: 298.150 k
press: 1.00000 atm
elementType: 8 8 7 7 6 6 6 6 6 6 6 6 6 6 6 6 6 6 1 1 1 1 1 1 1 1 1 1 1 1 1 1 1 1 1 1 1 1
symmnumber: 1
zpe: 837788.9 jmol-1
zpe.correction: 0.319097 hartree
zpe.thermalcorrener: 0.337117 hartree
zpe.thermalcorrenthalpy: 0.338061 hartree
zpe.thermalcorrgfe: 0.270473 hartree
zpe.sumelectzpe: -804.081500 hartree
zpe.sumelectthermal: -804.063480 hartree
zpe.sumelectthermalent: -804.062536 hartree
zpe.sumelectthermalfe: -804.130124 hartree
dipole: -1.6030 1.9355 0.1531
dipole: 2.5178
quadrupole: -93.4550 -105.0656 -110.1292
quadrupole: 7.4484 2.4574 -0.5570
quadrupole: 9.4283 -2.1823 -7.2459 7.4484 2.4574 -0.5570
hfenergy: -804.4005967 hartree
pointgroup: C01 [X(C14H20N2O2)]
dipole: -0.6308089 0.7628986 0.0364944 debye
polarizability: 250.2952164|-1.3420908|170.533455|1.8141153|2.7402706|108.0474236 unknown
InChI: InChI=1S/C14H20N2O2/c1-3-16-9-8-12(10-16)18-14(17)15-13-7-5-4-6-11(13)2/h4-7,12,15H,3,8-10H2,1-2H3
charge 0 multiplicity 1
38 atoms
O  -0.98788 0.00271 -0.241498
O  0.395118 -1.903114 -0.40893
N  -4.205036 0.185709 0.392779
N  1.241726 0.29626 -0.093569
C  -2.186789 -0.879491 -0.354432
C  -2.603446 -1.4423 1.034375
C  -3.374032 -0.012306 -0.82353
C  -4.104557 -1.094338 1.142509
C  -5.587114 0.640575 0.141103
C  -5.640892 2.046731 -0.482953
C  0.255969 -0.662813 -0.260097
C  2.652721 0.111284 -0.059004
C  3.462394 1.274959 0.134927
C  3.249773 -1.167312 -0.208656
C  4.866065 1.112989 0.17326
C  2.836932 2.651019 0.296558
C  4.654093 -1.291953 -0.164916
C  5.471068 -0.155936 0.025903
H  -1.931956 -1.678875 -1.070004
H  -2.034904 -0.901667 1.810388
H  -2.394511 -2.519519 1.131733
H  -3.027671 0.944965 -1.246651
H  -3.938197 -0.562808 -1.621037
H  -4.727861 -1.902267 0.676621
H  -4.442797 -0.963284 2.185468
H  -6.13746 -0.081476 -0.520973
H  -6.117214 0.651752 1.112719
H  -5.103312 2.768773 0.156418
H  -5.178596 2.063282 -1.486389
H  -6.688542 2.381809 -0.590617
H  0.886656 1.247911 0.01567
H  2.611631 -2.041024 -0.355574
H  5.49325 2.00033 0.321578
H  2.169152 2.706692 1.180049
H  3.616865 3.417771 0.43407
H  2.244083 2.948629 -0.592076
H  5.106316 -2.283139 -0.281165
H  6.561354 -0.253128 0.059741
