program: Gaussian 09
title: 000036484
version: EM64L-G09RevD.01
frameworkgroup: C1[X(C8H18O6S2)]
method: RPBEPBE
basis: SDD
operation: Freq
keyword: #p
keyword: freq=noraman
keyword: PBEPBE/SDD
title: #p freq=noraman PBEPBE/SDD
converged: YES YES NO NO
title: Mulliken charges:
elementType: S S O O O O O O C C C C C C C C H H H H H H H H H H H H H H H H H H
charge: 0.953822 0.954126 -0.440048 -0.439690 -0.416949 -0.417232 -0.567153 -0.567410 -0.371948 -0.372913 -0.003708 -0.004813 -0.697536 -0.697383 -0.516984 -0.516465 0.259964 0.170517 0.170454 0.259425 0.226518 0.228651 0.238015 0.205891 0.231576 0.231991 0.236813 0.205902 0.258882 0.244044 0.225185 0.244239 0.225801 0.258412
chargesum: 0.00000
title: Mulliken charges with hydrogens summed into heavy atoms:
elementType: S S O O O O O O C C C C C C C C
charge: 0.953822 0.954126 -0.440048 -0.439690 -0.416949 -0.417232 -0.567153 -0.567410 0.058533 0.056966 0.222810 0.223837 -0.022053 -0.022677 0.211128 0.211988
polarizability: 1.82945168e+02 1.88514224e+01 1.79516758e+02 -7.94449566e-02 2.09746619e-01 1.16208636e+02
1716.lowfreq: -20.2747 -16.3765 -14.6602 -0.0019 0.0010 0.0013 6.3962 12.3372 21.6573
frequency: -18.8956 -8.0931 21.6385 24.8911 34.5707 69.5704 97.2192 101.1076 110.7441 130.1183 131.1600 142.3499 160.1638 161.9917 168.8058 177.9454 204.7517 214.2225 233.9746 241.8101 254.1221 283.7490 296.3884 349.8674 355.7969 409.9621 417.9343 439.3314 444.0660 466.2867 467.4222 495.1148 500.9030 565.6030 570.7482 749.3802 779.2956 807.8221 895.8544 896.2168 902.6177 905.5129 923.4765 924.2749 929.8910 987.5839 1037.7246 1054.3513 1091.0655 1091.2014 1110.5976 1123.2220 1124.5559 1125.5250 1130.3619 1143.5322 1204.4093 1249.9390 1286.7919 1290.7867 1328.0199 1328.5943 1330.1028 1363.4020 1382.9548 1384.9513 1408.3139 1410.0243 1442.8331 1450.8817 1457.2835 1459.1914 1462.9824 1465.5039 1471.3475 1471.8557 1473.9095 1474.1666 2943.8949 2945.6876 2964.4048 2965.3377 2966.7498 2969.2271 2987.0900 2987.3821 3043.9549 3048.4896 3049.9158 3061.9467 3083.3949 3084.0409 3089.5508 3090.5597 3101.8735 3101.8924
redmass: 6.0979 5.7421 8.0574 4.8807 5.8645 4.6488 2.9447 2.8448 3.9241 1.9969 2.2990 1.6573 3.1608 2.2222 2.3806 2.2593 1.1244 1.1593 3.9130 4.6254 4.2881 2.9191 3.5857 4.8871 4.0466 4.7325 5.3611 8.1273 8.0149 5.9800 6.7686 4.2459 4.6336 4.2145 3.4160 1.8652 4.9821 2.2261 4.8208 5.3570 3.0320 2.2321 8.5762 9.1759 1.4483 1.6769 1.9505 2.6566 1.2315 1.2347 2.0344 1.5549 1.4091 1.3719 2.4086 2.1722 1.5486 1.2819 1.2292 1.3196 1.3362 1.1920 1.2159 1.6406 1.2215 1.2310 1.1127 1.1135 1.0685 1.0653 1.0560 1.0571 1.0498 1.0652 1.0512 1.0512 1.0505 1.0504 1.0343 1.0340 1.0740 1.0658 1.0765 1.0793 1.0367 1.0368 1.0922 1.0944 1.0949 1.1000 1.0982 1.0983 1.1046 1.1045 1.1011 1.1011
irintensity: 0.2592 0.0409 0.3045 0.1420 0.3632 0.0180 0.3585 7.8311 1.1296 0.2264 1.8268 1.5159 3.0678 5.3432 16.6053 4.3893 0.1869 0.1092 0.5211 23.3057 1.2692 0.0660 16.3223 2.9982 43.7198 0.2628 0.3612 3.5095 146.8809 36.1478 7.8772 55.4548 4.0951 121.6781 1.0716 0.5665 157.8893 14.9132 32.7599 27.7695 46.4375 6.3389 38.4046 41.1997 4.4036 23.9729 71.3687 0.2367 4.0830 1.7912 6.4918 5.7028 3.9737 1.8692 2.9019 18.2808 2.9959 14.4544 1.1729 1.1124 14.7315 24.5053 30.2031 0.6490 39.9498 0.0596 18.0181 17.6661 2.5609 3.3816 5.5098 2.2935 2.5275 25.0968 12.3998 26.8110 11.5781 8.0747 25.3677 25.2398 0.7892 42.9036 12.8782 21.7534 34.9621 16.5034 0.8365 20.2775 22.4771 12.2465 18.4349 40.9624 37.2907 29.8012 12.1260 26.4474
temp: 298.150 k
press: 1.00000 atm
elementType: 16 16 8 8 8 8 8 8 6 6 6 6 6 6 6 6 1 1 1 1 1 1 1 1 1 1 1 1 1 1 1 1 1 1
symmnumber: 1
zpe: 685233.1 jmol-1
zpe.correction: 0.260992 hartree
zpe.thermalcorrener: 0.281614 hartree
zpe.thermalcorrenthalpy: 0.282558 hartree
zpe.thermalcorrgfe: 0.210044 hartree
zpe.sumelectzpe: -1561.578167 hartree
zpe.sumelectthermal: -1561.557544 hartree
zpe.sumelectthermalent: -1561.556600 hartree
zpe.sumelectthermalfe: -1561.629114 hartree
dipole: 0.0046 0.0156 2.7533
dipole: 2.7534
quadrupole: -121.5934 -106.2090 -111.5689
quadrupole: 8.5500 0.1586 -0.0045
quadrupole: -8.4696 6.9148 1.5549 8.5500 0.1586 -0.0045
hfenergy: -1561.839158 hartree
pointgroup: C01[X(C8H18O6S2)]
dipole: -0.0237188 1.0824809 0.0332655 debye
polarizability: 187.4696229|1.8966318|116.2821495|-17.8199001|-1.6167745|174.9187899 unknown
InChI: InChI=1S/C8H18O6S2/c1-7(13-15(9)11-3)5-6-8(2)14-16(10)12-4/h7-8H,5-6H2,1-4H3
charge 0 multiplicity 1
34 atoms
S  -3.635399 -1.310387 -0.791272
S  3.705294 -1.1852 0.720111
O  -1.844265 -1.262537 -1.23684
O  1.918042 -1.254123 1.183839
O  -3.594721 -1.115321 1.087765
O  3.634418 -0.939229 -1.150488
O  -4.285196 0.077534 -1.319492
O  4.278826 0.220825 1.287706
C  0.09235 0.123891 -0.746387
C  -0.081434 0.072868 0.782738
C  -1.240191 0.08206 -1.518948
C  1.253305 0.040238 1.552282
C  -1.078173 0.217007 -3.03925
C  1.087646 0.068033 3.077982
C  -3.907723 0.238967 1.572531
C  3.863059 0.443971 -1.599412
H  0.725407 -0.721089 -1.074282
H  0.613133 1.060679 -1.038355
H  -0.641248 0.966651 1.131618
H  -0.677323 -0.816894 1.057396
H  -1.934837 0.865226 -1.146842
H  1.911488 0.877719 1.235458
H  -2.059573 0.176987 -3.5415
H  -0.601241 1.182722 -3.291039
H  -0.445543 -0.598364 -3.431589
H  0.49872 -0.801969 3.417099
H  2.070656 0.047471 3.578364
H  0.561475 0.98989 3.38945
H  -4.364118 0.853797 0.767887
H  -4.634701 0.118702 2.393668
H  -2.986262 0.72683 1.93722
H  4.564083 0.382861 -2.449063
H  2.907388 0.898641 -1.915643
H  4.318858 1.054741 -0.791712
